builder: autoland_ubuntu64-asan_vm_test-jsreftest slave: tst-linux64-spot-2567 starttime: 1470245291.68 results: failure (2) buildid: 20160803083722 builduid: f3a056a66363480aa4a2d226537312dd revision: 9a3134f679a4b595b2a6605f34760376d22ab3b6 ========= Started set props: master (results: 0, elapsed: 0 secs) (at 2016-08-03 10:28:11.685356) ========= master: http://buildbot-master51.bb.releng.use1.mozilla.com:8201/ ========= Finished set props: master (results: 0, elapsed: 0 secs) (at 2016-08-03 10:28:11.686167) ========= ========= Started downloading to buildprops.json (results: 0, elapsed: 0 secs) (at 2016-08-03 10:28:11.686454) ========= ========= Finished downloading to buildprops.json (results: 0, elapsed: 0 secs) (at 2016-08-03 10:28:12.099996) ========= ========= Started 'bash -c ...' (results: 0, elapsed: 0 secs) (at 2016-08-03 10:28:12.100383) ========= bash -c 'wget -Oarchiver_client.py --no-check-certificate --tries=10 --waitretry=3 https://hg.mozilla.org/build/tools/raw-file/default/buildfarm/utils/archiver_client.py' in dir /builds/slave/test/. (timeout 1200 secs) watching logfiles {} argv: ['bash', '-c', 'wget -Oarchiver_client.py --no-check-certificate --tries=10 --waitretry=3 https://hg.mozilla.org/build/tools/raw-file/default/buildfarm/utils/archiver_client.py'] environment: HOME=/home/cltbld LANG=en_US.UTF-8 LOGNAME=cltbld MAIL=/var/mail/cltbld NODE_PATH=/usr/lib/nodejs:/usr/lib/node_modules:/usr/share/javascript PATH=/usr/local/bin:/usr/local/bin:/usr/bin:/bin:/usr/local/games:/usr/games PWD=/builds/slave/test SHELL=/bin/bash SHLVL=1 TERM=linux TMOUT=86400 USER=cltbld XDG_SESSION_COOKIE=9ca12473fbb1d023794ffd180000023c-1470245005.707928-777100845 _=/tools/buildbot/bin/python using PTY: False --2016-08-03 10:28:12-- https://hg.mozilla.org/build/tools/raw-file/default/buildfarm/utils/archiver_client.py Resolving hg.mozilla.org (hg.mozilla.org)... 63.245.215.25, 63.245.215.102 Connecting to hg.mozilla.org (hg.mozilla.org)|63.245.215.25|:443... connected. HTTP request sent, awaiting response... 200 Script output follows Length: 12141 (12K) [text/x-python] Saving to: `archiver_client.py' 0K .......... . 100% 8.90M=0.001s 2016-08-03 10:28:12 (8.90 MB/s) - `archiver_client.py' saved [12141/12141] program finished with exit code 0 elapsedTime=0.569463 ========= master_lag: 0.17 ========= ========= Finished 'bash -c ...' (results: 0, elapsed: 0 secs) (at 2016-08-03 10:28:12.842944) ========= ========= Started 'rm -rf ...' (results: 0, elapsed: 0 secs) (at 2016-08-03 10:28:12.843284) ========= rm -rf scripts properties in dir /builds/slave/test/. (timeout 1200 secs) watching logfiles {} argv: ['rm', '-rf', 'scripts', 'properties'] environment: HOME=/home/cltbld LANG=en_US.UTF-8 LOGNAME=cltbld MAIL=/var/mail/cltbld NODE_PATH=/usr/lib/nodejs:/usr/lib/node_modules:/usr/share/javascript PATH=/usr/local/bin:/usr/local/bin:/usr/bin:/bin:/usr/local/games:/usr/games PWD=/builds/slave/test SHELL=/bin/bash SHLVL=1 TERM=linux TMOUT=86400 USER=cltbld XDG_SESSION_COOKIE=9ca12473fbb1d023794ffd180000023c-1470245005.707928-777100845 _=/tools/buildbot/bin/python using PTY: False program finished with exit code 0 elapsedTime=0.035427 ========= master_lag: 0.34 ========= ========= Finished 'rm -rf ...' (results: 0, elapsed: 0 secs) (at 2016-08-03 10:28:13.217781) ========= ========= Started 'bash -c ...' (results: 0, elapsed: 1 secs) (at 2016-08-03 10:28:13.218163) ========= bash -c 'python archiver_client.py mozharness --repo integration/autoland --rev 9a3134f679a4b595b2a6605f34760376d22ab3b6 --destination scripts --debug' in dir /builds/slave/test/. (timeout 1200 secs) watching logfiles {} argv: ['bash', '-c', u'python archiver_client.py mozharness --repo integration/autoland --rev 9a3134f679a4b595b2a6605f34760376d22ab3b6 --destination scripts --debug'] environment: HOME=/home/cltbld LANG=en_US.UTF-8 LOGNAME=cltbld MAIL=/var/mail/cltbld NODE_PATH=/usr/lib/nodejs:/usr/lib/node_modules:/usr/share/javascript PATH=/usr/local/bin:/usr/local/bin:/usr/bin:/bin:/usr/local/games:/usr/games PWD=/builds/slave/test SHELL=/bin/bash SHLVL=1 TERM=linux TMOUT=86400 USER=cltbld XDG_SESSION_COOKIE=9ca12473fbb1d023794ffd180000023c-1470245005.707928-777100845 _=/tools/buildbot/bin/python using PTY: False 2016-08-03 10:28:13,327 truncating revision to first 12 chars 2016-08-03 10:28:13,328 Setting DEBUG logging. 2016-08-03 10:28:13,328 attempt 1/10 2016-08-03 10:28:13,328 Getting archive location from https://api.pub.build.mozilla.org/archiver/hgmo/integration/autoland/9a3134f679a4?&preferred_region=us-west-2&suffix=tar.gz&subdir=testing/mozharness 2016-08-03 10:28:14,464 unpacking tar archive at: autoland-9a3134f679a4/testing/mozharness/ program finished with exit code 0 elapsedTime=1.631626 ========= master_lag: 0.05 ========= ========= Finished 'bash -c ...' (results: 0, elapsed: 1 secs) (at 2016-08-03 10:28:14.899634) ========= ========= Started set props: script_repo_revision (results: 0, elapsed: 0 secs) (at 2016-08-03 10:28:14.899942) ========= script_repo_revision: 9a3134f679a4b595b2a6605f34760376d22ab3b6 ========= Finished set props: script_repo_revision (results: 0, elapsed: 0 secs) (at 2016-08-03 10:28:14.900363) ========= ========= Started downloading to oauth.txt (results: 0, elapsed: 0 secs) (at 2016-08-03 10:28:14.900643) ========= ========= Finished downloading to oauth.txt (results: 0, elapsed: 0 secs) (at 2016-08-03 10:28:14.929880) ========= ========= Started '/tools/buildbot/bin/python scripts/scripts/desktop_unittest.py ...' failed (results: 2, elapsed: 6 mins, 41 secs) (at 2016-08-03 10:28:14.930174) ========= /tools/buildbot/bin/python scripts/scripts/desktop_unittest.py --cfg unittests/linux_unittest.py --reftest-suite jsreftest --blob-upload-branch autoland --download-symbols ondemand in dir /builds/slave/test/. (timeout 1800 secs) (maxTime 7200 secs) watching logfiles {} argv: ['/tools/buildbot/bin/python', 'scripts/scripts/desktop_unittest.py', '--cfg', 'unittests/linux_unittest.py', '--reftest-suite', 'jsreftest', '--blob-upload-branch', 'autoland', '--download-symbols', 'ondemand'] environment: DISPLAY=:0 HOME=/home/cltbld LANG=en_US.UTF-8 LOGNAME=cltbld MAIL=/var/mail/cltbld NODE_PATH=/usr/lib/nodejs:/usr/lib/node_modules:/usr/share/javascript PATH=/usr/local/bin:/usr/local/bin:/usr/bin:/bin:/usr/local/games:/usr/games PROPERTIES_FILE=/builds/slave/test/buildprops.json PWD=/builds/slave/test SHELL=/bin/bash SHLVL=1 TERM=linux TMOUT=86400 USER=cltbld XDG_SESSION_COOKIE=9ca12473fbb1d023794ffd180000023c-1470245005.707928-777100845 _=/tools/buildbot/bin/python using PTY: False 10:28:15 INFO - MultiFileLogger online at 20160803 10:28:15 in /builds/slave/test 10:28:15 INFO - Run as scripts/scripts/desktop_unittest.py --cfg unittests/linux_unittest.py --reftest-suite jsreftest --blob-upload-branch autoland --download-symbols ondemand 10:28:15 INFO - Dumping config to /builds/slave/test/logs/localconfig.json. 10:28:15 INFO - {'all_cppunittest_suites': {'cppunittest': {'tests': ('tests/cppunittest',)}}, 10:28:15 INFO - 'all_gtest_suites': {'gtest': ()}, 10:28:15 INFO - 'all_jittest_suites': {'jittest': (), 10:28:15 INFO - 'jittest-chunked': (), 10:28:15 INFO - 'jittest1': ('--total-chunks=2', '--this-chunk=1'), 10:28:15 INFO - 'jittest2': ('--total-chunks=2', '--this-chunk=2')}, 10:28:15 INFO - 'all_mochitest_suites': {'a11y': ('--a11y',), 10:28:15 INFO - 'browser-chrome': ('--browser-chrome',), 10:28:15 INFO - 'browser-chrome-addons': ('--browser-chrome', 10:28:15 INFO - '--chunk-by-runtime', 10:28:15 INFO - '--tag=addons'), 10:28:15 INFO - 'browser-chrome-chunked': ('--browser-chrome', 10:28:15 INFO - '--chunk-by-runtime'), 10:28:15 INFO - 'browser-chrome-clipboard': ('--browser-chrome', 10:28:15 INFO - '--subsuite=clipboard'), 10:28:15 INFO - 'browser-chrome-coverage': ('--browser-chrome', 10:28:15 INFO - '--chunk-by-runtime', 10:28:15 INFO - '--timeout=1200'), 10:28:15 INFO - 'browser-chrome-gpu': ('--browser-chrome', 10:28:15 INFO - '--subsuite=gpu'), 10:28:15 INFO - 'browser-chrome-screenshots': ('--browser-chrome', 10:28:15 INFO - '--subsuite=screenshots'), 10:28:15 INFO - 'chrome': ('--chrome',), 10:28:15 INFO - 'chrome-chunked': ('--chrome', '--chunk-by-dir=4'), 10:28:15 INFO - 'chrome-clipboard': ('--chrome', 10:28:15 INFO - '--subsuite=clipboard'), 10:28:15 INFO - 'chrome-gpu': ('--chrome', '--subsuite=gpu'), 10:28:15 INFO - 'jetpack-addon': ('--jetpack-addon',), 10:28:15 INFO - 'jetpack-package': ('--jetpack-package',), 10:28:15 INFO - 'jetpack-package-clipboard': ('--jetpack-package', 10:28:15 INFO - '--subsuite=clipboard'), 10:28:15 INFO - 'mochitest-devtools-chrome': ('--browser-chrome', 10:28:15 INFO - '--subsuite=devtools'), 10:28:15 INFO - 'mochitest-devtools-chrome-chunked': ('--browser-chrome', 10:28:15 INFO - '--subsuite=devtools', 10:28:15 INFO - '--chunk-by-runtime'), 10:28:15 INFO - 'mochitest-gl': ('--subsuite=webgl',), 10:28:15 INFO - 'mochitest-media': ('--subsuite=media',), 10:28:15 INFO - 'plain': (), 10:28:15 INFO - 'plain-chunked': ('--chunk-by-dir=4',), 10:28:15 INFO - 'plain-clipboard': ('--subsuite=clipboard',), 10:28:15 INFO - 'plain-gpu': ('--subsuite=gpu',), 10:28:15 INFO - 'valgrind-plain': ('--valgrind=/usr/bin/valgrind', 10:28:15 INFO - '--valgrind-supp-files=/builds/slave/test/build/tests/mochitest/x86_64-redhat-linux-gnu.sup,/builds/slave/test/build/tests/mochitest/cross-architecture.sup', 10:28:15 INFO - '--timeout=900', 10:28:15 INFO - '--max-timeouts=50')}, 10:28:15 INFO - 'all_mozbase_suites': {'mozbase': ()}, 10:28:15 INFO - 'all_reftest_suites': {'crashtest': {'options': ('--suite=crashtest',), 10:28:15 INFO - 'tests': ('tests/reftest/tests/testing/crashtest/crashtests.list',)}, 10:28:15 INFO - 'crashtest-ipc': {'env': {'MOZ_DISABLE_CONTEXT_SHARING_GLX': '1', 10:28:15 INFO - 'MOZ_OMTC_ENABLED': '1'}, 10:28:15 INFO - 'options': ('--suite=crashtest', 10:28:15 INFO - '--setpref=browser.tabs.remote=true', 10:28:15 INFO - '--setpref=browser.tabs.remote.autostart=true', 10:28:15 INFO - '--setpref=extensions.e10sBlocksEnabling=false', 10:28:15 INFO - '--setpref=layers.async-pan-zoom.enabled=true'), 10:28:15 INFO - 'tests': ('tests/reftest/tests/testing/crashtest/crashtests.list',)}, 10:28:15 INFO - 'jsreftest': {'options': ('--extra-profile-file=tests/jsreftest/tests/user.js', 10:28:15 INFO - '--suite=jstestbrowser'), 10:28:15 INFO - 'tests': ('tests/jsreftest/tests/jstests.list',)}, 10:28:15 INFO - 'reftest': {'options': ('--suite=reftest',), 10:28:15 INFO - 'tests': ('tests/reftest/tests/layout/reftests/reftest.list',)}, 10:28:15 INFO - 'reftest-ipc': {'env': {'MOZ_DISABLE_CONTEXT_SHARING_GLX': '1', 10:28:15 INFO - 'MOZ_OMTC_ENABLED': '1'}, 10:28:15 INFO - 'options': ('--suite=reftest', 10:28:15 INFO - '--setpref=browser.tabs.remote=true', 10:28:15 INFO - '--setpref=browser.tabs.remote.autostart=true', 10:28:15 INFO - '--setpref=extensions.e10sBlocksEnabling=false', 10:28:15 INFO - '--setpref=layers.async-pan-zoom.enabled=true'), 10:28:15 INFO - 'tests': ('tests/reftest/tests/layout/reftests/reftest-sanity/reftest.list',)}, 10:28:15 INFO - 'reftest-no-accel': {'options': ('--suite=reftest', 10:28:15 INFO - '--setpref=layers.acceleration.force-enabled=disabled'), 10:28:15 INFO - 'tests': ('tests/reftest/tests/layout/reftests/reftest.list',)}}, 10:28:15 INFO - 'all_xpcshell_suites': {'xpcshell': {'options': ('--xpcshell=%(abs_app_dir)s/xpcshell', 10:28:15 INFO - '--manifest=tests/xpcshell/tests/xpcshell.ini'), 10:28:15 INFO - 'tests': ()}, 10:28:15 INFO - 'xpcshell-addons': {'options': ('--xpcshell=%(abs_app_dir)s/xpcshell', 10:28:15 INFO - '--tag=addons', 10:28:15 INFO - '--manifest=tests/xpcshell/tests/xpcshell.ini'), 10:28:15 INFO - 'tests': ()}, 10:28:15 INFO - 'xpcshell-coverage': {'options': ('--xpcshell=%(abs_app_dir)s/xpcshell', 10:28:15 INFO - '--manifest=tests/xpcshell/tests/xpcshell.ini'), 10:28:15 INFO - 'tests': ()}}, 10:28:15 INFO - 'append_to_log': False, 10:28:15 INFO - 'base_work_dir': '/builds/slave/test', 10:28:15 INFO - 'binary_path': '/builds/slave/test/build/firefox/firefox-bin', 10:28:15 INFO - 'blob_upload_branch': 'autoland', 10:28:15 INFO - 'blob_uploader_auth_file': '/builds/slave/test/oauth.txt', 10:28:15 INFO - 'buildbot_json_path': 'buildprops.json', 10:28:15 INFO - 'buildbot_max_log_size': 52428800, 10:28:15 INFO - 'code_coverage': False, 10:28:15 INFO - 'config_files': ('unittests/linux_unittest.py',), 10:28:15 INFO - 'default_blob_upload_servers': ('https://blobupload.elasticbeanstalk.com',), 10:28:15 INFO - 'download_minidump_stackwalk': True, 10:28:15 INFO - 'download_symbols': 'ondemand', 10:28:15 INFO - 'e10s': False, 10:28:15 INFO - 'exe_suffix': '', 10:28:15 INFO - 'exes': {'python': '/tools/buildbot/bin/python', 10:28:15 INFO - 'tooltool.py': '/tools/tooltool.py', 10:28:15 INFO - 'virtualenv': ('/tools/buildbot/bin/python', 10:28:15 INFO - '/tools/misc-python/virtualenv.py')}, 10:28:15 INFO - 'find_links': ('http://pypi.pvt.build.mozilla.org/pub', 10:28:15 INFO - 'http://pypi.pub.build.mozilla.org/pub'), 10:28:15 INFO - 'installer_path': '/builds/slave/test/build/installer.tar.bz2', 10:28:15 INFO - 'log_level': 'info', 10:28:15 INFO - 'log_to_console': True, 10:28:15 INFO - 'minidump_save_path': '%(abs_work_dir)s/../minidumps', 10:28:15 INFO - 'minidump_stackwalk_path': 'linux64-minidump_stackwalk', 10:28:15 INFO - 'minidump_tooltool_manifest_path': 'config/tooltool-manifests/linux64/releng.manifest', 10:28:15 INFO - 'minimum_tests_zip_dirs': ('bin/*', 10:28:15 INFO - 'certs/*', 10:28:15 INFO - 'config/*', 10:28:15 INFO - 'mach', 10:28:15 INFO - 'marionette/*', 10:28:15 INFO - 'modules/*', 10:28:15 INFO - 'mozbase/*', 10:28:15 INFO - 'tools/*'), 10:28:15 INFO - 'no_random': False, 10:28:15 INFO - 'opt_config_files': (), 10:28:15 INFO - 'pip_index': False, 10:28:15 INFO - 'preflight_run_cmd_suites': ({'architectures': ('32bit', '64bit'), 10:28:15 INFO - 'cmd': ('xset', 's', 'off', 's', 'reset'), 10:28:15 INFO - 'enabled': True, 10:28:15 INFO - 'halt_on_failure': False, 10:28:15 INFO - 'name': 'disable_screen_saver'}, 10:28:15 INFO - {'architectures': ('32bit',), 10:28:15 INFO - 'cmd': ('python', 10:28:15 INFO - '../scripts/external_tools/mouse_and_screen_resolution.py', 10:28:15 INFO - '--configuration-url', 10:28:15 INFO - 'https://hg.mozilla.org/%(branch)s/raw-file/%(revision)s/testing/machine-configuration.json'), 10:28:15 INFO - 'enabled': False, 10:28:15 INFO - 'halt_on_failure': True, 10:28:15 INFO - 'name': 'run mouse & screen adjustment script'}), 10:28:15 INFO - 'require_test_zip': True, 10:28:15 INFO - 'run_all_suites': False, 10:28:15 INFO - 'run_cmd_checks_enabled': True, 10:28:15 INFO - 'run_file_names': {'cppunittest': 'runcppunittests.py', 10:28:15 INFO - 'gtest': 'rungtests.py', 10:28:15 INFO - 'jittest': 'jit_test.py', 10:28:15 INFO - 'mochitest': 'runtests.py', 10:28:15 INFO - 'mozbase': 'test.py', 10:28:15 INFO - 'mozmill': 'runtestlist.py', 10:28:15 INFO - 'reftest': 'runreftest.py', 10:28:15 INFO - 'xpcshell': 'runxpcshelltests.py'}, 10:28:15 INFO - 'specific_tests_zip_dirs': {'cppunittest': ('cppunittest/*',), 10:28:15 INFO - 'gtest': ('gtest/*',), 10:28:15 INFO - 'jittest': ('jit-test/*',), 10:28:15 INFO - 'mochitest': ('mochitest/*',), 10:28:15 INFO - 'mozbase': ('mozbase/*',), 10:28:15 INFO - 'mozmill': ('mozmill/*',), 10:28:15 INFO - 'reftest': ('reftest/*', 'jsreftest/*'), 10:28:15 INFO - 'xpcshell': ('xpcshell/*',)}, 10:28:15 INFO - 'specified_reftest_suites': ('jsreftest',), 10:28:15 INFO - 'strict_content_sandbox': False, 10:28:15 INFO - 'suite_definitions': {'cppunittest': {'options': ('--symbols-path=%(symbols_path)s', 10:28:15 INFO - '--xre-path=%(abs_app_dir)s'), 10:28:15 INFO - 'run_filename': 'runcppunittests.py', 10:28:15 INFO - 'testsdir': 'cppunittest'}, 10:28:15 INFO - 'gtest': {'options': ('--xre-path=%(abs_res_dir)s', 10:28:15 INFO - '--cwd=%(gtest_dir)s', 10:28:15 INFO - '--symbols-path=%(symbols_path)s', 10:28:15 INFO - '--utility-path=tests/bin', 10:28:15 INFO - '%(binary_path)s'), 10:28:15 INFO - 'run_filename': 'rungtests.py'}, 10:28:15 INFO - 'jittest': {'options': ('tests/bin/js', 10:28:15 INFO - '--no-slow', 10:28:15 INFO - '--no-progress', 10:28:15 INFO - '--format=automation', 10:28:15 INFO - '--jitflags=all', 10:28:15 INFO - '--timeout=970'), 10:28:15 INFO - 'run_filename': 'jit_test.py', 10:28:15 INFO - 'run_timeout': 1000, 10:28:15 INFO - 'testsdir': 'jit-test/jit-test'}, 10:28:15 INFO - 'luciddream-b2gdt': {'options': ('--startup-timeout=300', 10:28:15 INFO - '--log-raw=%(raw_log_file)s', 10:28:15 INFO - '--log-errorsummary=%(error_summary_file)s', 10:28:15 INFO - '--browser-path=%(browser_path)s', 10:28:15 INFO - '--b2g-desktop-path=%(fxos_desktop_path)s', 10:28:15 INFO - '--gaia-profile=%(gaia_profile)s', 10:28:15 INFO - '%(test_manifest)s')}, 10:28:15 INFO - 'luciddream-emulator': {'options': ('--startup-timeout=300', 10:28:15 INFO - '--log-raw=%(raw_log_file)s', 10:28:15 INFO - '--log-errorsummary=%(error_summary_file)s', 10:28:15 INFO - '--browser-path=%(browser_path)s', 10:28:15 INFO - '--b2gpath=%(emulator_path)s', 10:28:15 INFO - '%(test_manifest)s')}, 10:28:15 INFO - 'mochitest': {'options': ('--appname=%(binary_path)s', 10:28:15 INFO - '--utility-path=tests/bin', 10:28:15 INFO - '--extra-profile-file=tests/bin/plugins', 10:28:15 INFO - '--symbols-path=%(symbols_path)s', 10:28:15 INFO - '--certificate-path=tests/certs', 10:28:15 INFO - '--setpref=webgl.force-enabled=true', 10:28:15 INFO - '--quiet', 10:28:15 INFO - '--log-raw=%(raw_log_file)s', 10:28:15 INFO - '--log-errorsummary=%(error_summary_file)s', 10:28:15 INFO - '--use-test-media-devices', 10:28:15 INFO - '--screenshot-on-fail', 10:28:15 INFO - '--cleanup-crashes'), 10:28:15 INFO - 'run_filename': 'runtests.py', 10:28:15 INFO - 'testsdir': 'mochitest'}, 10:28:15 INFO - 'mozbase': {'options': ('-b', '%(binary_path)s'), 10:28:15 INFO - 'run_filename': 'test.py', 10:28:15 INFO - 'testsdir': 'mozbase'}, 10:28:15 INFO - 'mozmill': {'options': ('--binary=%(binary_path)s', 10:28:15 INFO - '--testing-modules-dir=test/modules', 10:28:15 INFO - '--plugins-path=%(test_plugin_path)s', 10:28:15 INFO - '--symbols-path=%(symbols_path)s'), 10:28:15 INFO - 'run_filename': 'runtestlist.py', 10:28:15 INFO - 'testsdir': 'mozmill'}, 10:28:15 INFO - 'reftest': {'options': ('--appname=%(binary_path)s', 10:28:15 INFO - '--utility-path=tests/bin', 10:28:15 INFO - '--extra-profile-file=tests/bin/plugins', 10:28:15 INFO - '--symbols-path=%(symbols_path)s', 10:28:15 INFO - '--log-raw=%(raw_log_file)s', 10:28:15 INFO - '--log-errorsummary=%(error_summary_file)s', 10:28:15 INFO - '--cleanup-crashes'), 10:28:15 INFO - 'run_filename': 'runreftest.py', 10:28:15 INFO - 'testsdir': 'reftest'}, 10:28:15 INFO - 'xpcshell': {'options': ('--symbols-path=%(symbols_path)s', 10:28:15 INFO - '--test-plugin-path=%(test_plugin_path)s', 10:28:15 INFO - '--log-raw=%(raw_log_file)s', 10:28:15 INFO - '--log-errorsummary=%(error_summary_file)s', 10:28:15 INFO - '--utility-path=tests/bin'), 10:28:15 INFO - 'run_filename': 'runxpcshelltests.py', 10:28:15 INFO - 'testsdir': 'xpcshell'}}, 10:28:15 INFO - 'tooltool_cache': '/builds/tooltool_cache', 10:28:15 INFO - 'vcs_output_timeout': 1000, 10:28:15 INFO - 'virtualenv_path': 'venv', 10:28:15 INFO - 'volatile_config': {'actions': None, 'add_actions': None, 'no_actions': None}, 10:28:15 INFO - 'work_dir': 'build', 10:28:15 INFO - 'xpcshell_name': 'xpcshell'} 10:28:15 INFO - [mozharness: 2016-08-03 17:28:15.306217Z] Running clobber step. 10:28:15 INFO - Running pre-action listener: _resource_record_pre_action 10:28:15 INFO - Running main action method: clobber 10:28:15 INFO - rmtree: /builds/slave/test/build 10:28:15 INFO - retry: Calling rmtree with args: ('/builds/slave/test/build',), kwargs: {}, attempt #1 10:28:17 INFO - Running post-action listener: _resource_record_post_action 10:28:17 INFO - [mozharness: 2016-08-03 17:28:17.143110Z] Finished clobber step (success) 10:28:17 INFO - [mozharness: 2016-08-03 17:28:17.143462Z] Running read-buildbot-config step. 10:28:17 INFO - Running pre-action listener: _resource_record_pre_action 10:28:17 INFO - Running main action method: read_buildbot_config 10:28:17 INFO - Using buildbot properties: 10:28:17 INFO - { 10:28:17 INFO - "project": "", 10:28:17 INFO - "product": "firefox", 10:28:17 INFO - "script_repo_revision": "production", 10:28:17 INFO - "scheduler": "tests-autoland-ubuntu64-asan_vm-opt-unittest", 10:28:17 INFO - "repository": "", 10:28:17 INFO - "buildername": "Ubuntu ASAN VM 12.04 x64 autoland opt test jsreftest", 10:28:17 INFO - "buildid": "20160803083722", 10:28:17 INFO - "pgo_build": "False", 10:28:17 INFO - "basedir": "/builds/slave/test", 10:28:17 INFO - "buildnumber": 34, 10:28:17 INFO - "slavename": "tst-linux64-spot-2567", 10:28:17 INFO - "master": "http://buildbot-master51.bb.releng.use1.mozilla.com:8201/", 10:28:17 INFO - "platform": "linux64-asan", 10:28:17 INFO - "branch": "autoland", 10:28:17 INFO - "revision": "9a3134f679a4b595b2a6605f34760376d22ab3b6", 10:28:17 INFO - "repo_path": "integration/autoland", 10:28:17 INFO - "moz_repo_path": "", 10:28:17 INFO - "stage_platform": "linux64-asan", 10:28:17 INFO - "builduid": "f3a056a66363480aa4a2d226537312dd", 10:28:17 INFO - "slavebuilddir": "test" 10:28:17 INFO - } 10:28:17 INFO - Found installer url https://queue.taskcluster.net/v1/task/K3PRIIzlTx60gLnmQg3gVg/artifacts/public/build/firefox-51.0a1.en-US.linux-x86_64-asan.tar.bz2. 10:28:17 INFO - Found a test packages url https://queue.taskcluster.net/v1/task/K3PRIIzlTx60gLnmQg3gVg/artifacts/public/build/firefox-51.0a1.en-US.linux-x86_64-asan.test_packages.json. 10:28:17 INFO - Running post-action listener: _resource_record_post_action 10:28:17 INFO - [mozharness: 2016-08-03 17:28:17.152203Z] Finished read-buildbot-config step (success) 10:28:17 INFO - [mozharness: 2016-08-03 17:28:17.152486Z] Running download-and-extract step. 10:28:17 INFO - Running pre-action listener: _resource_record_pre_action 10:28:17 INFO - Running main action method: download_and_extract 10:28:17 INFO - mkdir: /builds/slave/test/build/tests 10:28:17 INFO - proxxy config: {'regions': ['.use1.', '.usw2.', '.scl3'], 'instances': ['proxxy1.srv.releng.use1.mozilla.com', 'proxxy1.srv.releng.usw2.mozilla.com', 'proxxy1.srv.releng.scl3.mozilla.com'], 'urls': [('http://ftp.mozilla.org', 'ftp.mozilla.org'), ('https://ftp.mozilla.org', 'ftp.mozilla.org'), ('https://ftp-ssl.mozilla.org', 'ftp.mozilla.org'), ('http://pvtbuilds.pvt.build.mozilla.org', 'pvtbuilds.mozilla.org'), ('http://pypi.pvt.build.mozilla.org', 'pypi.pvt.build.mozilla.org'), ('http://pypi.pub.build.mozilla.org', 'pypi.pub.build.mozilla.org'), ('https://queue.taskcluster.net', 'queue.taskcluster.net')]} 10:28:17 INFO - https://queue.taskcluster.net/v1/task/K3PRIIzlTx60gLnmQg3gVg/artifacts/public/build/firefox-51.0a1.en-US.linux-x86_64-asan.test_packages.json matches https://queue.taskcluster.net 10:28:17 INFO - URL Candidate: http://queue.taskcluster.net.proxxy1.srv.releng.use1.mozilla.com/v1/task/K3PRIIzlTx60gLnmQg3gVg/artifacts/public/build/firefox-51.0a1.en-US.linux-x86_64-asan.test_packages.json 10:28:17 INFO - trying http://queue.taskcluster.net.proxxy1.srv.releng.use1.mozilla.com/v1/task/K3PRIIzlTx60gLnmQg3gVg/artifacts/public/build/firefox-51.0a1.en-US.linux-x86_64-asan.test_packages.json 10:28:17 INFO - Downloading http://queue.taskcluster.net.proxxy1.srv.releng.use1.mozilla.com/v1/task/K3PRIIzlTx60gLnmQg3gVg/artifacts/public/build/firefox-51.0a1.en-US.linux-x86_64-asan.test_packages.json to /builds/slave/test/build/firefox-51.0a1.en-US.linux-x86_64-asan.test_packages.json 10:28:17 INFO - retry: Calling _download_file with args: (), kwargs: {'url': 'http://queue.taskcluster.net.proxxy1.srv.releng.use1.mozilla.com/v1/task/K3PRIIzlTx60gLnmQg3gVg/artifacts/public/build/firefox-51.0a1.en-US.linux-x86_64-asan.test_packages.json', 'file_name': '/builds/slave/test/build/firefox-51.0a1.en-US.linux-x86_64-asan.test_packages.json'}, attempt #1 10:28:19 INFO - Downloaded 1451 bytes. 10:28:19 INFO - Reading from file /builds/slave/test/build/firefox-51.0a1.en-US.linux-x86_64-asan.test_packages.json 10:28:19 INFO - Using the following test package requirements: 10:28:19 INFO - {u'common': [u'firefox-51.0a1.en-US.linux-x86_64-asan.common.tests.zip'], 10:28:19 INFO - u'cppunittest': [u'firefox-51.0a1.en-US.linux-x86_64-asan.common.tests.zip', 10:28:19 INFO - u'firefox-51.0a1.en-US.linux-x86_64-asan.cppunittest.tests.zip'], 10:28:19 INFO - u'gtest': [u'firefox-51.0a1.en-US.linux-x86_64-asan.common.tests.zip', 10:28:19 INFO - u'firefox-51.0a1.en-US.linux-x86_64-asan.gtest.tests.zip'], 10:28:19 INFO - u'jittest': [u'firefox-51.0a1.en-US.linux-x86_64-asan.common.tests.zip', 10:28:19 INFO - u'jsshell-linux-x86_64-asan.zip'], 10:28:19 INFO - u'mochitest': [u'firefox-51.0a1.en-US.linux-x86_64-asan.common.tests.zip', 10:28:19 INFO - u'firefox-51.0a1.en-US.linux-x86_64-asan.mochitest.tests.zip'], 10:28:19 INFO - u'mozbase': [u'firefox-51.0a1.en-US.linux-x86_64-asan.common.tests.zip'], 10:28:19 INFO - u'reftest': [u'firefox-51.0a1.en-US.linux-x86_64-asan.common.tests.zip', 10:28:19 INFO - u'firefox-51.0a1.en-US.linux-x86_64-asan.reftest.tests.zip'], 10:28:19 INFO - u'talos': [u'firefox-51.0a1.en-US.linux-x86_64-asan.common.tests.zip', 10:28:19 INFO - u'firefox-51.0a1.en-US.linux-x86_64-asan.talos.tests.zip'], 10:28:19 INFO - u'web-platform': [u'firefox-51.0a1.en-US.linux-x86_64-asan.common.tests.zip', 10:28:19 INFO - u'firefox-51.0a1.en-US.linux-x86_64-asan.web-platform.tests.zip'], 10:28:19 INFO - u'xpcshell': [u'firefox-51.0a1.en-US.linux-x86_64-asan.common.tests.zip', 10:28:19 INFO - u'firefox-51.0a1.en-US.linux-x86_64-asan.xpcshell.tests.zip']} 10:28:19 INFO - Downloading packages: [u'firefox-51.0a1.en-US.linux-x86_64-asan.common.tests.zip', u'firefox-51.0a1.en-US.linux-x86_64-asan.reftest.tests.zip'] for test suite category: reftest 10:28:19 INFO - proxxy config: {'regions': ['.use1.', '.usw2.', '.scl3'], 'instances': ['proxxy1.srv.releng.use1.mozilla.com', 'proxxy1.srv.releng.usw2.mozilla.com', 'proxxy1.srv.releng.scl3.mozilla.com'], 'urls': [('http://ftp.mozilla.org', 'ftp.mozilla.org'), ('https://ftp.mozilla.org', 'ftp.mozilla.org'), ('https://ftp-ssl.mozilla.org', 'ftp.mozilla.org'), ('http://pvtbuilds.pvt.build.mozilla.org', 'pvtbuilds.mozilla.org'), ('http://pypi.pvt.build.mozilla.org', 'pypi.pvt.build.mozilla.org'), ('http://pypi.pub.build.mozilla.org', 'pypi.pub.build.mozilla.org'), ('https://queue.taskcluster.net', 'queue.taskcluster.net')]} 10:28:19 INFO - https://queue.taskcluster.net/v1/task/K3PRIIzlTx60gLnmQg3gVg/artifacts/public/build/firefox-51.0a1.en-US.linux-x86_64-asan.common.tests.zip matches https://queue.taskcluster.net 10:28:19 INFO - URL Candidate: http://queue.taskcluster.net.proxxy1.srv.releng.use1.mozilla.com/v1/task/K3PRIIzlTx60gLnmQg3gVg/artifacts/public/build/firefox-51.0a1.en-US.linux-x86_64-asan.common.tests.zip 10:28:19 INFO - trying http://queue.taskcluster.net.proxxy1.srv.releng.use1.mozilla.com/v1/task/K3PRIIzlTx60gLnmQg3gVg/artifacts/public/build/firefox-51.0a1.en-US.linux-x86_64-asan.common.tests.zip 10:28:19 INFO - Downloading http://queue.taskcluster.net.proxxy1.srv.releng.use1.mozilla.com/v1/task/K3PRIIzlTx60gLnmQg3gVg/artifacts/public/build/firefox-51.0a1.en-US.linux-x86_64-asan.common.tests.zip to /builds/slave/test/build/firefox-51.0a1.en-US.linux-x86_64-asan.common.tests.zip 10:28:19 INFO - retry: Calling _download_file with args: (), kwargs: {'url': u'http://queue.taskcluster.net.proxxy1.srv.releng.use1.mozilla.com/v1/task/K3PRIIzlTx60gLnmQg3gVg/artifacts/public/build/firefox-51.0a1.en-US.linux-x86_64-asan.common.tests.zip', 'file_name': u'/builds/slave/test/build/firefox-51.0a1.en-US.linux-x86_64-asan.common.tests.zip'}, attempt #1 10:28:23 INFO - Downloaded 23695242 bytes. 10:28:23 INFO - Running command: ['unzip', '-q', '-o', u'/builds/slave/test/build/firefox-51.0a1.en-US.linux-x86_64-asan.common.tests.zip', '-d', '/builds/slave/test/build/tests', 'bin/*', 'certs/*', 'config/*', 'mach', 'marionette/*', 'modules/*', 'mozbase/*', 'tools/*', 'reftest/*', 'jsreftest/*'] 10:28:23 INFO - Copy/paste: unzip -q -o /builds/slave/test/build/firefox-51.0a1.en-US.linux-x86_64-asan.common.tests.zip -d /builds/slave/test/build/tests bin/* certs/* config/* mach marionette/* modules/* mozbase/* tools/* reftest/* jsreftest/* 10:28:24 INFO - caution: filename not matched: reftest/* 10:28:24 INFO - Return code: 11 10:28:24 INFO - proxxy config: {'regions': ['.use1.', '.usw2.', '.scl3'], 'instances': ['proxxy1.srv.releng.use1.mozilla.com', 'proxxy1.srv.releng.usw2.mozilla.com', 'proxxy1.srv.releng.scl3.mozilla.com'], 'urls': [('http://ftp.mozilla.org', 'ftp.mozilla.org'), ('https://ftp.mozilla.org', 'ftp.mozilla.org'), ('https://ftp-ssl.mozilla.org', 'ftp.mozilla.org'), ('http://pvtbuilds.pvt.build.mozilla.org', 'pvtbuilds.mozilla.org'), ('http://pypi.pvt.build.mozilla.org', 'pypi.pvt.build.mozilla.org'), ('http://pypi.pub.build.mozilla.org', 'pypi.pub.build.mozilla.org'), ('https://queue.taskcluster.net', 'queue.taskcluster.net')]} 10:28:24 INFO - https://queue.taskcluster.net/v1/task/K3PRIIzlTx60gLnmQg3gVg/artifacts/public/build/firefox-51.0a1.en-US.linux-x86_64-asan.reftest.tests.zip matches https://queue.taskcluster.net 10:28:24 INFO - URL Candidate: http://queue.taskcluster.net.proxxy1.srv.releng.use1.mozilla.com/v1/task/K3PRIIzlTx60gLnmQg3gVg/artifacts/public/build/firefox-51.0a1.en-US.linux-x86_64-asan.reftest.tests.zip 10:28:24 INFO - trying http://queue.taskcluster.net.proxxy1.srv.releng.use1.mozilla.com/v1/task/K3PRIIzlTx60gLnmQg3gVg/artifacts/public/build/firefox-51.0a1.en-US.linux-x86_64-asan.reftest.tests.zip 10:28:24 INFO - Downloading http://queue.taskcluster.net.proxxy1.srv.releng.use1.mozilla.com/v1/task/K3PRIIzlTx60gLnmQg3gVg/artifacts/public/build/firefox-51.0a1.en-US.linux-x86_64-asan.reftest.tests.zip to /builds/slave/test/build/firefox-51.0a1.en-US.linux-x86_64-asan.reftest.tests.zip 10:28:24 INFO - retry: Calling _download_file with args: (), kwargs: {'url': u'http://queue.taskcluster.net.proxxy1.srv.releng.use1.mozilla.com/v1/task/K3PRIIzlTx60gLnmQg3gVg/artifacts/public/build/firefox-51.0a1.en-US.linux-x86_64-asan.reftest.tests.zip', 'file_name': u'/builds/slave/test/build/firefox-51.0a1.en-US.linux-x86_64-asan.reftest.tests.zip'}, attempt #1 10:28:29 INFO - Downloaded 31634881 bytes. 10:28:29 INFO - Running command: ['unzip', '-q', '-o', u'/builds/slave/test/build/firefox-51.0a1.en-US.linux-x86_64-asan.reftest.tests.zip', '-d', '/builds/slave/test/build/tests', 'bin/*', 'certs/*', 'config/*', 'mach', 'marionette/*', 'modules/*', 'mozbase/*', 'tools/*', 'reftest/*', 'jsreftest/*'] 10:28:29 INFO - Copy/paste: unzip -q -o /builds/slave/test/build/firefox-51.0a1.en-US.linux-x86_64-asan.reftest.tests.zip -d /builds/slave/test/build/tests bin/* certs/* config/* mach marionette/* modules/* mozbase/* tools/* reftest/* jsreftest/* 10:28:33 INFO - caution: filename not matched: bin/* 10:28:33 INFO - caution: filename not matched: certs/* 10:28:33 INFO - caution: filename not matched: config/* 10:28:33 INFO - caution: filename not matched: mach 10:28:33 INFO - caution: filename not matched: marionette/* 10:28:33 INFO - caution: filename not matched: modules/* 10:28:33 INFO - caution: filename not matched: mozbase/* 10:28:33 INFO - caution: filename not matched: tools/* 10:28:33 INFO - caution: filename not matched: jsreftest/* 10:28:33 INFO - Return code: 11 10:28:33 INFO - proxxy config: {'regions': ['.use1.', '.usw2.', '.scl3'], 'instances': ['proxxy1.srv.releng.use1.mozilla.com', 'proxxy1.srv.releng.usw2.mozilla.com', 'proxxy1.srv.releng.scl3.mozilla.com'], 'urls': [('http://ftp.mozilla.org', 'ftp.mozilla.org'), ('https://ftp.mozilla.org', 'ftp.mozilla.org'), ('https://ftp-ssl.mozilla.org', 'ftp.mozilla.org'), ('http://pvtbuilds.pvt.build.mozilla.org', 'pvtbuilds.mozilla.org'), ('http://pypi.pvt.build.mozilla.org', 'pypi.pvt.build.mozilla.org'), ('http://pypi.pub.build.mozilla.org', 'pypi.pub.build.mozilla.org'), ('https://queue.taskcluster.net', 'queue.taskcluster.net')]} 10:28:33 INFO - https://queue.taskcluster.net/v1/task/K3PRIIzlTx60gLnmQg3gVg/artifacts/public/build/firefox-51.0a1.en-US.linux-x86_64-asan.tar.bz2 matches https://queue.taskcluster.net 10:28:33 INFO - URL Candidate: http://queue.taskcluster.net.proxxy1.srv.releng.use1.mozilla.com/v1/task/K3PRIIzlTx60gLnmQg3gVg/artifacts/public/build/firefox-51.0a1.en-US.linux-x86_64-asan.tar.bz2 10:28:33 INFO - trying http://queue.taskcluster.net.proxxy1.srv.releng.use1.mozilla.com/v1/task/K3PRIIzlTx60gLnmQg3gVg/artifacts/public/build/firefox-51.0a1.en-US.linux-x86_64-asan.tar.bz2 10:28:33 INFO - Downloading http://queue.taskcluster.net.proxxy1.srv.releng.use1.mozilla.com/v1/task/K3PRIIzlTx60gLnmQg3gVg/artifacts/public/build/firefox-51.0a1.en-US.linux-x86_64-asan.tar.bz2 to /builds/slave/test/build/installer.tar.bz2 10:28:33 INFO - retry: Calling _download_file with args: (), kwargs: {'url': 'http://queue.taskcluster.net.proxxy1.srv.releng.use1.mozilla.com/v1/task/K3PRIIzlTx60gLnmQg3gVg/artifacts/public/build/firefox-51.0a1.en-US.linux-x86_64-asan.tar.bz2', 'file_name': '/builds/slave/test/build/installer.tar.bz2'}, attempt #1 10:28:44 INFO - Downloaded 204049644 bytes. 10:28:44 INFO - Setting buildbot property build_url to https://queue.taskcluster.net/v1/task/K3PRIIzlTx60gLnmQg3gVg/artifacts/public/build/firefox-51.0a1.en-US.linux-x86_64-asan.tar.bz2 10:28:44 INFO - mkdir: /builds/slave/test/properties 10:28:44 INFO - Writing buildbot properties ['build_url'] to /builds/slave/test/properties/build_url 10:28:44 INFO - Writing to file /builds/slave/test/properties/build_url 10:28:44 INFO - Contents: 10:28:44 INFO - build_url:https://queue.taskcluster.net/v1/task/K3PRIIzlTx60gLnmQg3gVg/artifacts/public/build/firefox-51.0a1.en-US.linux-x86_64-asan.tar.bz2 10:28:45 WARNING - Can't figure out symbols_url from installer_url: https://queue.taskcluster.net/v1/task/K3PRIIzlTx60gLnmQg3gVg/artifacts/public/build/firefox-51.0a1.en-US.linux-x86_64-asan.tar.bz2! 10:28:45 WARNING - Traceback (most recent call last): 10:28:45 WARNING - 10:28:45 WARNING - File "/builds/slave/test/scripts/mozharness/mozilla/testing/testbase.py", line 200, in query_symbols_url 10:28:45 WARNING - self._urlopen(symbols_url, timeout=120) 10:28:45 WARNING - 10:28:45 WARNING - File "/builds/slave/test/scripts/mozharness/mozilla/testing/testbase.py", line 292, in _urlopen 10:28:45 WARNING - return urllib2.urlopen(url, **kwargs) 10:28:45 WARNING - 10:28:45 WARNING - File "/usr/lib/python2.7/urllib2.py", line 126, in urlopen 10:28:45 WARNING - return _opener.open(url, data, timeout) 10:28:45 WARNING - 10:28:45 WARNING - File "/usr/lib/python2.7/urllib2.py", line 406, in open 10:28:45 WARNING - response = meth(req, response) 10:28:45 WARNING - 10:28:45 WARNING - File "/usr/lib/python2.7/urllib2.py", line 519, in http_response 10:28:45 WARNING - 'http', request, response, code, msg, hdrs) 10:28:45 WARNING - 10:28:45 WARNING - File "/usr/lib/python2.7/urllib2.py", line 444, in error 10:28:45 WARNING - return self._call_chain(*args) 10:28:45 WARNING - 10:28:45 WARNING - File "/usr/lib/python2.7/urllib2.py", line 378, in _call_chain 10:28:45 WARNING - result = func(*args) 10:28:45 WARNING - 10:28:45 WARNING - File "/usr/lib/python2.7/urllib2.py", line 527, in http_error_default 10:28:45 WARNING - raise HTTPError(req.get_full_url(), code, msg, hdrs, fp) 10:28:45 WARNING - 10:28:45 WARNING - HTTPError: HTTP Error 404: Not Found 10:28:45 WARNING - 10:28:45 WARNING - No symbols_url found. Let minidump_stackwalk query for symbols. 10:28:45 INFO - Running post-action listener: _resource_record_post_action 10:28:45 INFO - Running post-action listener: set_extra_try_arguments 10:28:45 INFO - [mozharness: 2016-08-03 17:28:45.895425Z] Finished download-and-extract step (success) 10:28:45 INFO - [mozharness: 2016-08-03 17:28:45.895740Z] Running create-virtualenv step. 10:28:45 INFO - Running pre-action listener: _install_mozbase 10:28:45 INFO - Running pre-action listener: _pre_create_virtualenv 10:28:45 INFO - Running pre-action listener: _resource_record_pre_action 10:28:45 INFO - Running main action method: create_virtualenv 10:28:45 INFO - Creating virtualenv /builds/slave/test/build/venv 10:28:45 INFO - Running command: ['/tools/buildbot/bin/python', '/tools/misc-python/virtualenv.py', '--no-site-packages', '--distribute', '/builds/slave/test/build/venv'] in /builds/slave/test/build 10:28:45 INFO - Copy/paste: /tools/buildbot/bin/python /tools/misc-python/virtualenv.py --no-site-packages --distribute /builds/slave/test/build/venv 10:28:46 INFO - The --no-site-packages flag is deprecated; it is now the default behavior. 10:28:46 INFO - Using real prefix '/usr' 10:28:46 INFO - New python executable in /builds/slave/test/build/venv/bin/python 10:28:47 INFO - Installing distribute.............................................................................................................................................................................................done. 10:28:50 INFO - Installing pip.................done. 10:28:50 INFO - Return code: 0 10:28:50 INFO - Installing psutil>=3.1.1 into virtualenv /builds/slave/test/build/venv 10:28:50 INFO - proxxy config: {'regions': ['.use1.', '.usw2.', '.scl3'], 'instances': ['proxxy1.srv.releng.use1.mozilla.com', 'proxxy1.srv.releng.usw2.mozilla.com', 'proxxy1.srv.releng.scl3.mozilla.com'], 'urls': [('http://ftp.mozilla.org', 'ftp.mozilla.org'), ('https://ftp.mozilla.org', 'ftp.mozilla.org'), ('https://ftp-ssl.mozilla.org', 'ftp.mozilla.org'), ('http://pvtbuilds.pvt.build.mozilla.org', 'pvtbuilds.mozilla.org'), ('http://pypi.pvt.build.mozilla.org', 'pypi.pvt.build.mozilla.org'), ('http://pypi.pub.build.mozilla.org', 'pypi.pub.build.mozilla.org'), ('https://queue.taskcluster.net', 'queue.taskcluster.net')]} 10:28:50 INFO - http://pypi.pvt.build.mozilla.org/pub matches http://pypi.pvt.build.mozilla.org 10:28:50 INFO - URL Candidate: http://pypi.pvt.build.mozilla.org.proxxy1.srv.releng.use1.mozilla.com/pub 10:28:50 INFO - proxxy config: {'regions': ['.use1.', '.usw2.', '.scl3'], 'instances': ['proxxy1.srv.releng.use1.mozilla.com', 'proxxy1.srv.releng.usw2.mozilla.com', 'proxxy1.srv.releng.scl3.mozilla.com'], 'urls': [('http://ftp.mozilla.org', 'ftp.mozilla.org'), ('https://ftp.mozilla.org', 'ftp.mozilla.org'), ('https://ftp-ssl.mozilla.org', 'ftp.mozilla.org'), ('http://pvtbuilds.pvt.build.mozilla.org', 'pvtbuilds.mozilla.org'), ('http://pypi.pvt.build.mozilla.org', 'pypi.pvt.build.mozilla.org'), ('http://pypi.pub.build.mozilla.org', 'pypi.pub.build.mozilla.org'), ('https://queue.taskcluster.net', 'queue.taskcluster.net')]} 10:28:50 INFO - http://pypi.pub.build.mozilla.org/pub matches http://pypi.pub.build.mozilla.org 10:28:50 INFO - URL Candidate: http://pypi.pub.build.mozilla.org.proxxy1.srv.releng.use1.mozilla.com/pub 10:28:50 INFO - retry: Calling run_command with args: [['/builds/slave/test/build/venv/bin/pip', 'install', '--timeout', '120', '--no-index', '--find-links', 'http://pypi.pvt.build.mozilla.org.proxxy1.srv.releng.use1.mozilla.com/pub', '--find-links', 'http://pypi.pub.build.mozilla.org.proxxy1.srv.releng.use1.mozilla.com/pub', '--find-links', 'http://pypi.pvt.build.mozilla.org/pub', '--find-links', 'http://pypi.pub.build.mozilla.org/pub', 'psutil>=3.1.1']], kwargs: {'error_level': 'warning', 'error_list': [{'substr': 'not found or a compiler error:', 'level': 'warning'}, {'regex': <_sre.SRE_Pattern object at 0x21a01f0>, 'level': 'error'}, {'regex': <_sre.SRE_Pattern object at 0x7fbbdf36de40>, 'level': 'warning'}, {'regex': <_sre.SRE_Pattern object at 0x22c3df0>, 'level': 'debug'}, {'substr': 'command not found', 'level': 'error'}, {'regex': <_sre.SRE_Pattern object at 0x22bff90>, 'level': 'warning'}, {'substr': 'Traceback (most recent call last)', 'level': 'error'}, {'substr': 'SyntaxError: ', 'level': 'error'}, {'substr': 'TypeError: ', 'level': 'error'}, {'substr': 'NameError: ', 'level': 'error'}, {'substr': 'ZeroDivisionError: ', 'level': 'error'}, {'regex': <_sre.SRE_Pattern object at 0x22c18f0>, 'level': 'critical'}, {'regex': <_sre.SRE_Pattern object at 0x22c1b70>, 'level': 'critical'}], 'cwd': '/builds/slave/test/build', 'env': {'LANG': 'en_US.UTF-8', 'TERM': 'linux', 'SHELL': '/bin/bash', 'XDG_SESSION_COOKIE': '9ca12473fbb1d023794ffd180000023c-1470245005.707928-777100845', 'MAIL': '/var/mail/cltbld', 'SHLVL': '1', 'TMOUT': '86400', 'NODE_PATH': '/usr/lib/nodejs:/usr/lib/node_modules:/usr/share/javascript', 'PWD': '/builds/slave/test', 'LOGNAME': 'cltbld', 'USER': 'cltbld', 'PROPERTIES_FILE': '/builds/slave/test/buildprops.json', 'PATH': '/usr/local/bin:/usr/local/bin:/usr/bin:/bin:/usr/local/games:/usr/games', 'HOME': '/home/cltbld', 'DISPLAY': ':0', '_': '/tools/buildbot/bin/python'}}, attempt #1 10:28:50 INFO - Running command: ['/builds/slave/test/build/venv/bin/pip', 'install', '--timeout', '120', '--no-index', '--find-links', 'http://pypi.pvt.build.mozilla.org.proxxy1.srv.releng.use1.mozilla.com/pub', '--find-links', 'http://pypi.pub.build.mozilla.org.proxxy1.srv.releng.use1.mozilla.com/pub', '--find-links', 'http://pypi.pvt.build.mozilla.org/pub', '--find-links', 'http://pypi.pub.build.mozilla.org/pub', 'psutil>=3.1.1'] in /builds/slave/test/build 10:28:50 INFO - Copy/paste: /builds/slave/test/build/venv/bin/pip install --timeout 120 --no-index --find-links http://pypi.pvt.build.mozilla.org.proxxy1.srv.releng.use1.mozilla.com/pub --find-links http://pypi.pub.build.mozilla.org.proxxy1.srv.releng.use1.mozilla.com/pub --find-links http://pypi.pvt.build.mozilla.org/pub --find-links http://pypi.pub.build.mozilla.org/pub psutil>=3.1.1 10:28:50 INFO - Using env: {'DISPLAY': ':0', 10:28:50 INFO - 'HOME': '/home/cltbld', 10:28:50 INFO - 'LANG': 'en_US.UTF-8', 10:28:50 INFO - 'LOGNAME': 'cltbld', 10:28:50 INFO - 'MAIL': '/var/mail/cltbld', 10:28:50 INFO - 'NODE_PATH': '/usr/lib/nodejs:/usr/lib/node_modules:/usr/share/javascript', 10:28:50 INFO - 'PATH': '/usr/local/bin:/usr/local/bin:/usr/bin:/bin:/usr/local/games:/usr/games', 10:28:50 INFO - 'PROPERTIES_FILE': '/builds/slave/test/buildprops.json', 10:28:50 INFO - 'PWD': '/builds/slave/test', 10:28:50 INFO - 'SHELL': '/bin/bash', 10:28:50 INFO - 'SHLVL': '1', 10:28:50 INFO - 'TERM': 'linux', 10:28:50 INFO - 'TMOUT': '86400', 10:28:50 INFO - 'USER': 'cltbld', 10:28:50 INFO - 'XDG_SESSION_COOKIE': '9ca12473fbb1d023794ffd180000023c-1470245005.707928-777100845', 10:28:50 INFO - '_': '/tools/buildbot/bin/python'} 10:28:50 INFO - Ignoring indexes: https://pypi.python.org/simple/ 10:28:50 INFO - Downloading/unpacking psutil>=3.1.1 10:28:50 INFO - http://pypi.pvt.build.mozilla.org/pub uses an insecure transport scheme (http). Consider using https if pypi.pvt.build.mozilla.org has it available 10:28:50 INFO - http://pypi.pub.build.mozilla.org/pub uses an insecure transport scheme (http). Consider using https if pypi.pub.build.mozilla.org has it available 10:28:50 INFO - http://pypi.pvt.build.mozilla.org.proxxy1.srv.releng.use1.mozilla.com/pub uses an insecure transport scheme (http). Consider using https if pypi.pvt.build.mozilla.org.proxxy1.srv.releng.use1.mozilla.com has it available 10:28:50 INFO - http://pypi.pub.build.mozilla.org.proxxy1.srv.releng.use1.mozilla.com/pub uses an insecure transport scheme (http). Consider using https if pypi.pub.build.mozilla.org.proxxy1.srv.releng.use1.mozilla.com has it available 10:28:51 INFO - http://pypi.pvt.build.mozilla.org/pub uses an insecure transport scheme (http). Consider using https if pypi.pvt.build.mozilla.org has it available 10:28:51 INFO - http://pypi.pub.build.mozilla.org/pub uses an insecure transport scheme (http). Consider using https if pypi.pub.build.mozilla.org has it available 10:28:56 INFO - Running setup.py (path:/builds/slave/test/build/venv/build/psutil/setup.py) egg_info for package psutil 10:28:56 INFO - warning: no previously-included files matching '*' found under directory 'docs/_build' 10:28:56 INFO - warning: manifest_maker: MANIFEST.in, line 18: 'recursive-include' expects ... 10:28:56 INFO - Installing collected packages: psutil 10:28:56 INFO - Running setup.py install for psutil 10:28:56 INFO - building 'psutil._psutil_linux' extension 10:28:56 INFO - gcc -pthread -fno-strict-aliasing -DNDEBUG -g -fwrapv -O2 -Wall -Wstrict-prototypes -fPIC -DPSUTIL_VERSION=311 -I/usr/include/python2.7 -c psutil/_psutil_linux.c -o build/temp.linux-x86_64-2.7/psutil/_psutil_linux.o 10:28:57 INFO - gcc -pthread -shared -Wl,-O1 -Wl,-Bsymbolic-functions -Wl,-Bsymbolic-functions -Wl,-z,relro build/temp.linux-x86_64-2.7/psutil/_psutil_linux.o -o build/lib.linux-x86_64-2.7/psutil/_psutil_linux.so 10:28:57 INFO - building 'psutil._psutil_posix' extension 10:28:57 INFO - gcc -pthread -fno-strict-aliasing -DNDEBUG -g -fwrapv -O2 -Wall -Wstrict-prototypes -fPIC -I/usr/include/python2.7 -c psutil/_psutil_posix.c -o build/temp.linux-x86_64-2.7/psutil/_psutil_posix.o 10:28:57 INFO - gcc -pthread -shared -Wl,-O1 -Wl,-Bsymbolic-functions -Wl,-Bsymbolic-functions -Wl,-z,relro build/temp.linux-x86_64-2.7/psutil/_psutil_posix.o -o build/lib.linux-x86_64-2.7/psutil/_psutil_posix.so 10:28:57 INFO - warning: no previously-included files matching '*' found under directory 'docs/_build' 10:28:57 INFO - warning: manifest_maker: MANIFEST.in, line 18: 'recursive-include' expects ... 10:28:57 INFO - Successfully installed psutil 10:28:57 INFO - Cleaning up... 10:28:58 INFO - Return code: 0 10:28:58 INFO - Installing mozsystemmonitor==0.3 into virtualenv /builds/slave/test/build/venv 10:28:58 INFO - proxxy config: {'regions': ['.use1.', '.usw2.', '.scl3'], 'instances': ['proxxy1.srv.releng.use1.mozilla.com', 'proxxy1.srv.releng.usw2.mozilla.com', 'proxxy1.srv.releng.scl3.mozilla.com'], 'urls': [('http://ftp.mozilla.org', 'ftp.mozilla.org'), ('https://ftp.mozilla.org', 'ftp.mozilla.org'), ('https://ftp-ssl.mozilla.org', 'ftp.mozilla.org'), ('http://pvtbuilds.pvt.build.mozilla.org', 'pvtbuilds.mozilla.org'), ('http://pypi.pvt.build.mozilla.org', 'pypi.pvt.build.mozilla.org'), ('http://pypi.pub.build.mozilla.org', 'pypi.pub.build.mozilla.org'), ('https://queue.taskcluster.net', 'queue.taskcluster.net')]} 10:28:58 INFO - http://pypi.pvt.build.mozilla.org/pub matches http://pypi.pvt.build.mozilla.org 10:28:58 INFO - URL Candidate: http://pypi.pvt.build.mozilla.org.proxxy1.srv.releng.use1.mozilla.com/pub 10:28:58 INFO - proxxy config: {'regions': ['.use1.', '.usw2.', '.scl3'], 'instances': ['proxxy1.srv.releng.use1.mozilla.com', 'proxxy1.srv.releng.usw2.mozilla.com', 'proxxy1.srv.releng.scl3.mozilla.com'], 'urls': [('http://ftp.mozilla.org', 'ftp.mozilla.org'), ('https://ftp.mozilla.org', 'ftp.mozilla.org'), ('https://ftp-ssl.mozilla.org', 'ftp.mozilla.org'), ('http://pvtbuilds.pvt.build.mozilla.org', 'pvtbuilds.mozilla.org'), ('http://pypi.pvt.build.mozilla.org', 'pypi.pvt.build.mozilla.org'), ('http://pypi.pub.build.mozilla.org', 'pypi.pub.build.mozilla.org'), ('https://queue.taskcluster.net', 'queue.taskcluster.net')]} 10:28:58 INFO - http://pypi.pub.build.mozilla.org/pub matches http://pypi.pub.build.mozilla.org 10:28:58 INFO - URL Candidate: http://pypi.pub.build.mozilla.org.proxxy1.srv.releng.use1.mozilla.com/pub 10:28:58 INFO - retry: Calling run_command with args: [['/builds/slave/test/build/venv/bin/pip', 'install', '--timeout', '120', '--no-index', '--find-links', 'http://pypi.pvt.build.mozilla.org.proxxy1.srv.releng.use1.mozilla.com/pub', '--find-links', 'http://pypi.pub.build.mozilla.org.proxxy1.srv.releng.use1.mozilla.com/pub', '--find-links', 'http://pypi.pvt.build.mozilla.org/pub', '--find-links', 'http://pypi.pub.build.mozilla.org/pub', 'mozsystemmonitor==0.3']], kwargs: {'error_level': 'warning', 'error_list': [{'substr': 'not found or a compiler error:', 'level': 'warning'}, {'regex': <_sre.SRE_Pattern object at 0x21a01f0>, 'level': 'error'}, {'regex': <_sre.SRE_Pattern object at 0x7fbbdf36de40>, 'level': 'warning'}, {'regex': <_sre.SRE_Pattern object at 0x22c3df0>, 'level': 'debug'}, {'substr': 'command not found', 'level': 'error'}, {'regex': <_sre.SRE_Pattern object at 0x22bff90>, 'level': 'warning'}, {'substr': 'Traceback (most recent call last)', 'level': 'error'}, {'substr': 'SyntaxError: ', 'level': 'error'}, {'substr': 'TypeError: ', 'level': 'error'}, {'substr': 'NameError: ', 'level': 'error'}, {'substr': 'ZeroDivisionError: ', 'level': 'error'}, {'regex': <_sre.SRE_Pattern object at 0x22c18f0>, 'level': 'critical'}, {'regex': <_sre.SRE_Pattern object at 0x22c1b70>, 'level': 'critical'}], 'cwd': '/builds/slave/test/build', 'env': {'LANG': 'en_US.UTF-8', 'TERM': 'linux', 'SHELL': '/bin/bash', 'XDG_SESSION_COOKIE': '9ca12473fbb1d023794ffd180000023c-1470245005.707928-777100845', 'MAIL': '/var/mail/cltbld', 'SHLVL': '1', 'TMOUT': '86400', 'NODE_PATH': '/usr/lib/nodejs:/usr/lib/node_modules:/usr/share/javascript', 'PWD': '/builds/slave/test', 'LOGNAME': 'cltbld', 'USER': 'cltbld', 'PROPERTIES_FILE': '/builds/slave/test/buildprops.json', 'PATH': '/usr/local/bin:/usr/local/bin:/usr/bin:/bin:/usr/local/games:/usr/games', 'HOME': '/home/cltbld', 'DISPLAY': ':0', '_': '/tools/buildbot/bin/python'}}, attempt #1 10:28:58 INFO - Running command: ['/builds/slave/test/build/venv/bin/pip', 'install', '--timeout', '120', '--no-index', '--find-links', 'http://pypi.pvt.build.mozilla.org.proxxy1.srv.releng.use1.mozilla.com/pub', '--find-links', 'http://pypi.pub.build.mozilla.org.proxxy1.srv.releng.use1.mozilla.com/pub', '--find-links', 'http://pypi.pvt.build.mozilla.org/pub', '--find-links', 'http://pypi.pub.build.mozilla.org/pub', 'mozsystemmonitor==0.3'] in /builds/slave/test/build 10:28:58 INFO - Copy/paste: /builds/slave/test/build/venv/bin/pip install --timeout 120 --no-index --find-links http://pypi.pvt.build.mozilla.org.proxxy1.srv.releng.use1.mozilla.com/pub --find-links http://pypi.pub.build.mozilla.org.proxxy1.srv.releng.use1.mozilla.com/pub --find-links http://pypi.pvt.build.mozilla.org/pub --find-links http://pypi.pub.build.mozilla.org/pub mozsystemmonitor==0.3 10:28:58 INFO - Using env: {'DISPLAY': ':0', 10:28:58 INFO - 'HOME': '/home/cltbld', 10:28:58 INFO - 'LANG': 'en_US.UTF-8', 10:28:58 INFO - 'LOGNAME': 'cltbld', 10:28:58 INFO - 'MAIL': '/var/mail/cltbld', 10:28:58 INFO - 'NODE_PATH': '/usr/lib/nodejs:/usr/lib/node_modules:/usr/share/javascript', 10:28:58 INFO - 'PATH': '/usr/local/bin:/usr/local/bin:/usr/bin:/bin:/usr/local/games:/usr/games', 10:28:58 INFO - 'PROPERTIES_FILE': '/builds/slave/test/buildprops.json', 10:28:58 INFO - 'PWD': '/builds/slave/test', 10:28:58 INFO - 'SHELL': '/bin/bash', 10:28:58 INFO - 'SHLVL': '1', 10:28:58 INFO - 'TERM': 'linux', 10:28:58 INFO - 'TMOUT': '86400', 10:28:58 INFO - 'USER': 'cltbld', 10:28:58 INFO - 'XDG_SESSION_COOKIE': '9ca12473fbb1d023794ffd180000023c-1470245005.707928-777100845', 10:28:58 INFO - '_': '/tools/buildbot/bin/python'} 10:28:58 INFO - Ignoring indexes: https://pypi.python.org/simple/ 10:28:58 INFO - Downloading/unpacking mozsystemmonitor==0.3 10:28:58 INFO - http://pypi.pvt.build.mozilla.org/pub uses an insecure transport scheme (http). Consider using https if pypi.pvt.build.mozilla.org has it available 10:28:58 INFO - http://pypi.pub.build.mozilla.org/pub uses an insecure transport scheme (http). Consider using https if pypi.pub.build.mozilla.org has it available 10:28:58 INFO - http://pypi.pvt.build.mozilla.org.proxxy1.srv.releng.use1.mozilla.com/pub uses an insecure transport scheme (http). Consider using https if pypi.pvt.build.mozilla.org.proxxy1.srv.releng.use1.mozilla.com has it available 10:28:58 INFO - http://pypi.pub.build.mozilla.org.proxxy1.srv.releng.use1.mozilla.com/pub uses an insecure transport scheme (http). Consider using https if pypi.pub.build.mozilla.org.proxxy1.srv.releng.use1.mozilla.com has it available 10:28:58 INFO - http://pypi.pvt.build.mozilla.org/pub uses an insecure transport scheme (http). Consider using https if pypi.pvt.build.mozilla.org has it available 10:28:58 INFO - http://pypi.pub.build.mozilla.org/pub uses an insecure transport scheme (http). Consider using https if pypi.pub.build.mozilla.org has it available 10:29:04 INFO - Downloading mozsystemmonitor-0.3.tar.gz 10:29:04 INFO - Running setup.py (path:/builds/slave/test/build/venv/build/mozsystemmonitor/setup.py) egg_info for package mozsystemmonitor 10:29:04 INFO - Requirement already satisfied (use --upgrade to upgrade): psutil>=3.1.1 in ./venv/lib/python2.7/site-packages (from mozsystemmonitor==0.3) 10:29:04 INFO - Installing collected packages: mozsystemmonitor 10:29:04 INFO - Running setup.py install for mozsystemmonitor 10:29:04 INFO - Successfully installed mozsystemmonitor 10:29:04 INFO - Cleaning up... 10:29:04 INFO - Return code: 0 10:29:04 INFO - Installing jsonschema==2.5.1 into virtualenv /builds/slave/test/build/venv 10:29:04 INFO - proxxy config: {'regions': ['.use1.', '.usw2.', '.scl3'], 'instances': ['proxxy1.srv.releng.use1.mozilla.com', 'proxxy1.srv.releng.usw2.mozilla.com', 'proxxy1.srv.releng.scl3.mozilla.com'], 'urls': [('http://ftp.mozilla.org', 'ftp.mozilla.org'), ('https://ftp.mozilla.org', 'ftp.mozilla.org'), ('https://ftp-ssl.mozilla.org', 'ftp.mozilla.org'), ('http://pvtbuilds.pvt.build.mozilla.org', 'pvtbuilds.mozilla.org'), ('http://pypi.pvt.build.mozilla.org', 'pypi.pvt.build.mozilla.org'), ('http://pypi.pub.build.mozilla.org', 'pypi.pub.build.mozilla.org'), ('https://queue.taskcluster.net', 'queue.taskcluster.net')]} 10:29:04 INFO - http://pypi.pvt.build.mozilla.org/pub matches http://pypi.pvt.build.mozilla.org 10:29:04 INFO - URL Candidate: http://pypi.pvt.build.mozilla.org.proxxy1.srv.releng.use1.mozilla.com/pub 10:29:04 INFO - proxxy config: {'regions': ['.use1.', '.usw2.', '.scl3'], 'instances': ['proxxy1.srv.releng.use1.mozilla.com', 'proxxy1.srv.releng.usw2.mozilla.com', 'proxxy1.srv.releng.scl3.mozilla.com'], 'urls': [('http://ftp.mozilla.org', 'ftp.mozilla.org'), ('https://ftp.mozilla.org', 'ftp.mozilla.org'), ('https://ftp-ssl.mozilla.org', 'ftp.mozilla.org'), ('http://pvtbuilds.pvt.build.mozilla.org', 'pvtbuilds.mozilla.org'), ('http://pypi.pvt.build.mozilla.org', 'pypi.pvt.build.mozilla.org'), ('http://pypi.pub.build.mozilla.org', 'pypi.pub.build.mozilla.org'), ('https://queue.taskcluster.net', 'queue.taskcluster.net')]} 10:29:04 INFO - http://pypi.pub.build.mozilla.org/pub matches http://pypi.pub.build.mozilla.org 10:29:04 INFO - URL Candidate: http://pypi.pub.build.mozilla.org.proxxy1.srv.releng.use1.mozilla.com/pub 10:29:04 INFO - retry: Calling run_command with args: [['/builds/slave/test/build/venv/bin/pip', 'install', '--timeout', '120', '--no-index', '--find-links', 'http://pypi.pvt.build.mozilla.org.proxxy1.srv.releng.use1.mozilla.com/pub', '--find-links', 'http://pypi.pub.build.mozilla.org.proxxy1.srv.releng.use1.mozilla.com/pub', '--find-links', 'http://pypi.pvt.build.mozilla.org/pub', '--find-links', 'http://pypi.pub.build.mozilla.org/pub', 'jsonschema==2.5.1']], kwargs: {'error_level': 'warning', 'error_list': [{'substr': 'not found or a compiler error:', 'level': 'warning'}, {'regex': <_sre.SRE_Pattern object at 0x21a01f0>, 'level': 'error'}, {'regex': <_sre.SRE_Pattern object at 0x7fbbdf36de40>, 'level': 'warning'}, {'regex': <_sre.SRE_Pattern object at 0x22c3df0>, 'level': 'debug'}, {'substr': 'command not found', 'level': 'error'}, {'regex': <_sre.SRE_Pattern object at 0x22bff90>, 'level': 'warning'}, {'substr': 'Traceback (most recent call last)', 'level': 'error'}, {'substr': 'SyntaxError: ', 'level': 'error'}, {'substr': 'TypeError: ', 'level': 'error'}, {'substr': 'NameError: ', 'level': 'error'}, {'substr': 'ZeroDivisionError: ', 'level': 'error'}, {'regex': <_sre.SRE_Pattern object at 0x22c18f0>, 'level': 'critical'}, {'regex': <_sre.SRE_Pattern object at 0x22c1b70>, 'level': 'critical'}], 'cwd': '/builds/slave/test/build', 'env': {'LANG': 'en_US.UTF-8', 'TERM': 'linux', 'SHELL': '/bin/bash', 'XDG_SESSION_COOKIE': '9ca12473fbb1d023794ffd180000023c-1470245005.707928-777100845', 'MAIL': '/var/mail/cltbld', 'SHLVL': '1', 'TMOUT': '86400', 'NODE_PATH': '/usr/lib/nodejs:/usr/lib/node_modules:/usr/share/javascript', 'PWD': '/builds/slave/test', 'LOGNAME': 'cltbld', 'USER': 'cltbld', 'PROPERTIES_FILE': '/builds/slave/test/buildprops.json', 'PATH': '/usr/local/bin:/usr/local/bin:/usr/bin:/bin:/usr/local/games:/usr/games', 'HOME': '/home/cltbld', 'DISPLAY': ':0', '_': '/tools/buildbot/bin/python'}}, attempt #1 10:29:04 INFO - Running command: ['/builds/slave/test/build/venv/bin/pip', 'install', '--timeout', '120', '--no-index', '--find-links', 'http://pypi.pvt.build.mozilla.org.proxxy1.srv.releng.use1.mozilla.com/pub', '--find-links', 'http://pypi.pub.build.mozilla.org.proxxy1.srv.releng.use1.mozilla.com/pub', '--find-links', 'http://pypi.pvt.build.mozilla.org/pub', '--find-links', 'http://pypi.pub.build.mozilla.org/pub', 'jsonschema==2.5.1'] in /builds/slave/test/build 10:29:04 INFO - Copy/paste: /builds/slave/test/build/venv/bin/pip install --timeout 120 --no-index --find-links http://pypi.pvt.build.mozilla.org.proxxy1.srv.releng.use1.mozilla.com/pub --find-links http://pypi.pub.build.mozilla.org.proxxy1.srv.releng.use1.mozilla.com/pub --find-links http://pypi.pvt.build.mozilla.org/pub --find-links http://pypi.pub.build.mozilla.org/pub jsonschema==2.5.1 10:29:04 INFO - Using env: {'DISPLAY': ':0', 10:29:04 INFO - 'HOME': '/home/cltbld', 10:29:04 INFO - 'LANG': 'en_US.UTF-8', 10:29:04 INFO - 'LOGNAME': 'cltbld', 10:29:04 INFO - 'MAIL': '/var/mail/cltbld', 10:29:04 INFO - 'NODE_PATH': '/usr/lib/nodejs:/usr/lib/node_modules:/usr/share/javascript', 10:29:04 INFO - 'PATH': '/usr/local/bin:/usr/local/bin:/usr/bin:/bin:/usr/local/games:/usr/games', 10:29:04 INFO - 'PROPERTIES_FILE': '/builds/slave/test/buildprops.json', 10:29:04 INFO - 'PWD': '/builds/slave/test', 10:29:04 INFO - 'SHELL': '/bin/bash', 10:29:04 INFO - 'SHLVL': '1', 10:29:04 INFO - 'TERM': 'linux', 10:29:04 INFO - 'TMOUT': '86400', 10:29:04 INFO - 'USER': 'cltbld', 10:29:04 INFO - 'XDG_SESSION_COOKIE': '9ca12473fbb1d023794ffd180000023c-1470245005.707928-777100845', 10:29:04 INFO - '_': '/tools/buildbot/bin/python'} 10:29:05 INFO - Ignoring indexes: https://pypi.python.org/simple/ 10:29:05 INFO - Downloading/unpacking jsonschema==2.5.1 10:29:05 INFO - http://pypi.pvt.build.mozilla.org/pub uses an insecure transport scheme (http). Consider using https if pypi.pvt.build.mozilla.org has it available 10:29:05 INFO - http://pypi.pub.build.mozilla.org/pub uses an insecure transport scheme (http). Consider using https if pypi.pub.build.mozilla.org has it available 10:29:05 INFO - http://pypi.pvt.build.mozilla.org.proxxy1.srv.releng.use1.mozilla.com/pub uses an insecure transport scheme (http). Consider using https if pypi.pvt.build.mozilla.org.proxxy1.srv.releng.use1.mozilla.com has it available 10:29:05 INFO - http://pypi.pub.build.mozilla.org.proxxy1.srv.releng.use1.mozilla.com/pub uses an insecure transport scheme (http). Consider using https if pypi.pub.build.mozilla.org.proxxy1.srv.releng.use1.mozilla.com has it available 10:29:05 INFO - http://pypi.pvt.build.mozilla.org/pub uses an insecure transport scheme (http). Consider using https if pypi.pvt.build.mozilla.org has it available 10:29:05 INFO - http://pypi.pub.build.mozilla.org/pub uses an insecure transport scheme (http). Consider using https if pypi.pub.build.mozilla.org has it available 10:29:09 INFO - Downloading jsonschema-2.5.1-py2.py3-none-any.whl 10:29:10 INFO - Downloading/unpacking functools32 (from jsonschema==2.5.1) 10:29:10 INFO - http://pypi.pvt.build.mozilla.org/pub uses an insecure transport scheme (http). Consider using https if pypi.pvt.build.mozilla.org has it available 10:29:10 INFO - http://pypi.pub.build.mozilla.org/pub uses an insecure transport scheme (http). Consider using https if pypi.pub.build.mozilla.org has it available 10:29:10 INFO - http://pypi.pvt.build.mozilla.org.proxxy1.srv.releng.use1.mozilla.com/pub uses an insecure transport scheme (http). Consider using https if pypi.pvt.build.mozilla.org.proxxy1.srv.releng.use1.mozilla.com has it available 10:29:10 INFO - http://pypi.pub.build.mozilla.org.proxxy1.srv.releng.use1.mozilla.com/pub uses an insecure transport scheme (http). Consider using https if pypi.pub.build.mozilla.org.proxxy1.srv.releng.use1.mozilla.com has it available 10:29:10 INFO - http://pypi.pvt.build.mozilla.org/pub uses an insecure transport scheme (http). Consider using https if pypi.pvt.build.mozilla.org has it available 10:29:10 INFO - http://pypi.pub.build.mozilla.org/pub uses an insecure transport scheme (http). Consider using https if pypi.pub.build.mozilla.org has it available 10:29:10 INFO - Downloading functools32-3.2.3-2.tar.gz 10:29:10 INFO - Running setup.py (path:/builds/slave/test/build/venv/build/functools32/setup.py) egg_info for package functools32 10:29:10 INFO - warning: no files found matching '*.txt' 10:29:10 INFO - no previously-included directories found matching 'build' 10:29:10 INFO - no previously-included directories found matching 'dist' 10:29:10 INFO - no previously-included directories found matching '.git*' 10:29:10 INFO - Installing collected packages: jsonschema, functools32 10:29:10 INFO - Running setup.py install for functools32 10:29:10 INFO - warning: no files found matching '*.txt' 10:29:10 INFO - no previously-included directories found matching 'build' 10:29:10 INFO - no previously-included directories found matching 'dist' 10:29:10 INFO - no previously-included directories found matching '.git*' 10:29:10 INFO - Successfully installed jsonschema functools32 10:29:10 INFO - Cleaning up... 10:29:11 INFO - Return code: 0 10:29:11 INFO - Installing functools32==3.2.3-2 into virtualenv /builds/slave/test/build/venv 10:29:11 INFO - proxxy config: {'regions': ['.use1.', '.usw2.', '.scl3'], 'instances': ['proxxy1.srv.releng.use1.mozilla.com', 'proxxy1.srv.releng.usw2.mozilla.com', 'proxxy1.srv.releng.scl3.mozilla.com'], 'urls': [('http://ftp.mozilla.org', 'ftp.mozilla.org'), ('https://ftp.mozilla.org', 'ftp.mozilla.org'), ('https://ftp-ssl.mozilla.org', 'ftp.mozilla.org'), ('http://pvtbuilds.pvt.build.mozilla.org', 'pvtbuilds.mozilla.org'), ('http://pypi.pvt.build.mozilla.org', 'pypi.pvt.build.mozilla.org'), ('http://pypi.pub.build.mozilla.org', 'pypi.pub.build.mozilla.org'), ('https://queue.taskcluster.net', 'queue.taskcluster.net')]} 10:29:11 INFO - http://pypi.pvt.build.mozilla.org/pub matches http://pypi.pvt.build.mozilla.org 10:29:11 INFO - URL Candidate: http://pypi.pvt.build.mozilla.org.proxxy1.srv.releng.use1.mozilla.com/pub 10:29:11 INFO - proxxy config: {'regions': ['.use1.', '.usw2.', '.scl3'], 'instances': ['proxxy1.srv.releng.use1.mozilla.com', 'proxxy1.srv.releng.usw2.mozilla.com', 'proxxy1.srv.releng.scl3.mozilla.com'], 'urls': [('http://ftp.mozilla.org', 'ftp.mozilla.org'), ('https://ftp.mozilla.org', 'ftp.mozilla.org'), ('https://ftp-ssl.mozilla.org', 'ftp.mozilla.org'), ('http://pvtbuilds.pvt.build.mozilla.org', 'pvtbuilds.mozilla.org'), ('http://pypi.pvt.build.mozilla.org', 'pypi.pvt.build.mozilla.org'), ('http://pypi.pub.build.mozilla.org', 'pypi.pub.build.mozilla.org'), ('https://queue.taskcluster.net', 'queue.taskcluster.net')]} 10:29:11 INFO - http://pypi.pub.build.mozilla.org/pub matches http://pypi.pub.build.mozilla.org 10:29:11 INFO - URL Candidate: http://pypi.pub.build.mozilla.org.proxxy1.srv.releng.use1.mozilla.com/pub 10:29:11 INFO - retry: Calling run_command with args: [['/builds/slave/test/build/venv/bin/pip', 'install', '--timeout', '120', '--no-index', '--find-links', 'http://pypi.pvt.build.mozilla.org.proxxy1.srv.releng.use1.mozilla.com/pub', '--find-links', 'http://pypi.pub.build.mozilla.org.proxxy1.srv.releng.use1.mozilla.com/pub', '--find-links', 'http://pypi.pvt.build.mozilla.org/pub', '--find-links', 'http://pypi.pub.build.mozilla.org/pub', 'functools32==3.2.3-2']], kwargs: {'error_level': 'warning', 'error_list': [{'substr': 'not found or a compiler error:', 'level': 'warning'}, {'regex': <_sre.SRE_Pattern object at 0x21a01f0>, 'level': 'error'}, {'regex': <_sre.SRE_Pattern object at 0x7fbbdf36de40>, 'level': 'warning'}, {'regex': <_sre.SRE_Pattern object at 0x22c3df0>, 'level': 'debug'}, {'substr': 'command not found', 'level': 'error'}, {'regex': <_sre.SRE_Pattern object at 0x22bff90>, 'level': 'warning'}, {'substr': 'Traceback (most recent call last)', 'level': 'error'}, {'substr': 'SyntaxError: ', 'level': 'error'}, {'substr': 'TypeError: ', 'level': 'error'}, {'substr': 'NameError: ', 'level': 'error'}, {'substr': 'ZeroDivisionError: ', 'level': 'error'}, {'regex': <_sre.SRE_Pattern object at 0x22c18f0>, 'level': 'critical'}, {'regex': <_sre.SRE_Pattern object at 0x22c1b70>, 'level': 'critical'}], 'cwd': '/builds/slave/test/build', 'env': {'LANG': 'en_US.UTF-8', 'TERM': 'linux', 'SHELL': '/bin/bash', 'XDG_SESSION_COOKIE': '9ca12473fbb1d023794ffd180000023c-1470245005.707928-777100845', 'MAIL': '/var/mail/cltbld', 'SHLVL': '1', 'TMOUT': '86400', 'NODE_PATH': '/usr/lib/nodejs:/usr/lib/node_modules:/usr/share/javascript', 'PWD': '/builds/slave/test', 'LOGNAME': 'cltbld', 'USER': 'cltbld', 'PROPERTIES_FILE': '/builds/slave/test/buildprops.json', 'PATH': '/usr/local/bin:/usr/local/bin:/usr/bin:/bin:/usr/local/games:/usr/games', 'HOME': '/home/cltbld', 'DISPLAY': ':0', '_': '/tools/buildbot/bin/python'}}, attempt #1 10:29:11 INFO - Running command: ['/builds/slave/test/build/venv/bin/pip', 'install', '--timeout', '120', '--no-index', '--find-links', 'http://pypi.pvt.build.mozilla.org.proxxy1.srv.releng.use1.mozilla.com/pub', '--find-links', 'http://pypi.pub.build.mozilla.org.proxxy1.srv.releng.use1.mozilla.com/pub', '--find-links', 'http://pypi.pvt.build.mozilla.org/pub', '--find-links', 'http://pypi.pub.build.mozilla.org/pub', 'functools32==3.2.3-2'] in /builds/slave/test/build 10:29:11 INFO - Copy/paste: /builds/slave/test/build/venv/bin/pip install --timeout 120 --no-index --find-links http://pypi.pvt.build.mozilla.org.proxxy1.srv.releng.use1.mozilla.com/pub --find-links http://pypi.pub.build.mozilla.org.proxxy1.srv.releng.use1.mozilla.com/pub --find-links http://pypi.pvt.build.mozilla.org/pub --find-links http://pypi.pub.build.mozilla.org/pub functools32==3.2.3-2 10:29:11 INFO - Using env: {'DISPLAY': ':0', 10:29:11 INFO - 'HOME': '/home/cltbld', 10:29:11 INFO - 'LANG': 'en_US.UTF-8', 10:29:11 INFO - 'LOGNAME': 'cltbld', 10:29:11 INFO - 'MAIL': '/var/mail/cltbld', 10:29:11 INFO - 'NODE_PATH': '/usr/lib/nodejs:/usr/lib/node_modules:/usr/share/javascript', 10:29:11 INFO - 'PATH': '/usr/local/bin:/usr/local/bin:/usr/bin:/bin:/usr/local/games:/usr/games', 10:29:11 INFO - 'PROPERTIES_FILE': '/builds/slave/test/buildprops.json', 10:29:11 INFO - 'PWD': '/builds/slave/test', 10:29:11 INFO - 'SHELL': '/bin/bash', 10:29:11 INFO - 'SHLVL': '1', 10:29:11 INFO - 'TERM': 'linux', 10:29:11 INFO - 'TMOUT': '86400', 10:29:11 INFO - 'USER': 'cltbld', 10:29:11 INFO - 'XDG_SESSION_COOKIE': '9ca12473fbb1d023794ffd180000023c-1470245005.707928-777100845', 10:29:11 INFO - '_': '/tools/buildbot/bin/python'} 10:29:11 INFO - Ignoring indexes: https://pypi.python.org/simple/ 10:29:11 INFO - Requirement already satisfied (use --upgrade to upgrade): functools32==3.2.3-2 in ./venv/lib/python2.7/site-packages 10:29:11 INFO - Cleaning up... 10:29:11 INFO - Return code: 0 10:29:11 INFO - Installing blobuploader==1.2.4 into virtualenv /builds/slave/test/build/venv 10:29:11 INFO - proxxy config: {'regions': ['.use1.', '.usw2.', '.scl3'], 'instances': ['proxxy1.srv.releng.use1.mozilla.com', 'proxxy1.srv.releng.usw2.mozilla.com', 'proxxy1.srv.releng.scl3.mozilla.com'], 'urls': [('http://ftp.mozilla.org', 'ftp.mozilla.org'), ('https://ftp.mozilla.org', 'ftp.mozilla.org'), ('https://ftp-ssl.mozilla.org', 'ftp.mozilla.org'), ('http://pvtbuilds.pvt.build.mozilla.org', 'pvtbuilds.mozilla.org'), ('http://pypi.pvt.build.mozilla.org', 'pypi.pvt.build.mozilla.org'), ('http://pypi.pub.build.mozilla.org', 'pypi.pub.build.mozilla.org'), ('https://queue.taskcluster.net', 'queue.taskcluster.net')]} 10:29:11 INFO - http://pypi.pvt.build.mozilla.org/pub matches http://pypi.pvt.build.mozilla.org 10:29:11 INFO - URL Candidate: http://pypi.pvt.build.mozilla.org.proxxy1.srv.releng.use1.mozilla.com/pub 10:29:11 INFO - proxxy config: {'regions': ['.use1.', '.usw2.', '.scl3'], 'instances': ['proxxy1.srv.releng.use1.mozilla.com', 'proxxy1.srv.releng.usw2.mozilla.com', 'proxxy1.srv.releng.scl3.mozilla.com'], 'urls': [('http://ftp.mozilla.org', 'ftp.mozilla.org'), ('https://ftp.mozilla.org', 'ftp.mozilla.org'), ('https://ftp-ssl.mozilla.org', 'ftp.mozilla.org'), ('http://pvtbuilds.pvt.build.mozilla.org', 'pvtbuilds.mozilla.org'), ('http://pypi.pvt.build.mozilla.org', 'pypi.pvt.build.mozilla.org'), ('http://pypi.pub.build.mozilla.org', 'pypi.pub.build.mozilla.org'), ('https://queue.taskcluster.net', 'queue.taskcluster.net')]} 10:29:11 INFO - http://pypi.pub.build.mozilla.org/pub matches http://pypi.pub.build.mozilla.org 10:29:11 INFO - URL Candidate: http://pypi.pub.build.mozilla.org.proxxy1.srv.releng.use1.mozilla.com/pub 10:29:11 INFO - retry: Calling run_command with args: [['/builds/slave/test/build/venv/bin/pip', 'install', '--timeout', '120', '--no-index', '--find-links', 'http://pypi.pvt.build.mozilla.org.proxxy1.srv.releng.use1.mozilla.com/pub', '--find-links', 'http://pypi.pub.build.mozilla.org.proxxy1.srv.releng.use1.mozilla.com/pub', '--find-links', 'http://pypi.pvt.build.mozilla.org/pub', '--find-links', 'http://pypi.pub.build.mozilla.org/pub', 'blobuploader==1.2.4']], kwargs: {'error_level': 'warning', 'error_list': [{'substr': 'not found or a compiler error:', 'level': 'warning'}, {'regex': <_sre.SRE_Pattern object at 0x21a01f0>, 'level': 'error'}, {'regex': <_sre.SRE_Pattern object at 0x7fbbdf36de40>, 'level': 'warning'}, {'regex': <_sre.SRE_Pattern object at 0x22c3df0>, 'level': 'debug'}, {'substr': 'command not found', 'level': 'error'}, {'regex': <_sre.SRE_Pattern object at 0x22bff90>, 'level': 'warning'}, {'substr': 'Traceback (most recent call last)', 'level': 'error'}, {'substr': 'SyntaxError: ', 'level': 'error'}, {'substr': 'TypeError: ', 'level': 'error'}, {'substr': 'NameError: ', 'level': 'error'}, {'substr': 'ZeroDivisionError: ', 'level': 'error'}, {'regex': <_sre.SRE_Pattern object at 0x22c18f0>, 'level': 'critical'}, {'regex': <_sre.SRE_Pattern object at 0x22c1b70>, 'level': 'critical'}], 'cwd': '/builds/slave/test/build', 'env': {'LANG': 'en_US.UTF-8', 'TERM': 'linux', 'SHELL': '/bin/bash', 'XDG_SESSION_COOKIE': '9ca12473fbb1d023794ffd180000023c-1470245005.707928-777100845', 'MAIL': '/var/mail/cltbld', 'SHLVL': '1', 'TMOUT': '86400', 'NODE_PATH': '/usr/lib/nodejs:/usr/lib/node_modules:/usr/share/javascript', 'PWD': '/builds/slave/test', 'LOGNAME': 'cltbld', 'USER': 'cltbld', 'PROPERTIES_FILE': '/builds/slave/test/buildprops.json', 'PATH': '/usr/local/bin:/usr/local/bin:/usr/bin:/bin:/usr/local/games:/usr/games', 'HOME': '/home/cltbld', 'DISPLAY': ':0', '_': '/tools/buildbot/bin/python'}}, attempt #1 10:29:11 INFO - Running command: ['/builds/slave/test/build/venv/bin/pip', 'install', '--timeout', '120', '--no-index', '--find-links', 'http://pypi.pvt.build.mozilla.org.proxxy1.srv.releng.use1.mozilla.com/pub', '--find-links', 'http://pypi.pub.build.mozilla.org.proxxy1.srv.releng.use1.mozilla.com/pub', '--find-links', 'http://pypi.pvt.build.mozilla.org/pub', '--find-links', 'http://pypi.pub.build.mozilla.org/pub', 'blobuploader==1.2.4'] in /builds/slave/test/build 10:29:11 INFO - Copy/paste: /builds/slave/test/build/venv/bin/pip install --timeout 120 --no-index --find-links http://pypi.pvt.build.mozilla.org.proxxy1.srv.releng.use1.mozilla.com/pub --find-links http://pypi.pub.build.mozilla.org.proxxy1.srv.releng.use1.mozilla.com/pub --find-links http://pypi.pvt.build.mozilla.org/pub --find-links http://pypi.pub.build.mozilla.org/pub blobuploader==1.2.4 10:29:11 INFO - Using env: {'DISPLAY': ':0', 10:29:11 INFO - 'HOME': '/home/cltbld', 10:29:11 INFO - 'LANG': 'en_US.UTF-8', 10:29:11 INFO - 'LOGNAME': 'cltbld', 10:29:11 INFO - 'MAIL': '/var/mail/cltbld', 10:29:11 INFO - 'NODE_PATH': '/usr/lib/nodejs:/usr/lib/node_modules:/usr/share/javascript', 10:29:11 INFO - 'PATH': '/usr/local/bin:/usr/local/bin:/usr/bin:/bin:/usr/local/games:/usr/games', 10:29:11 INFO - 'PROPERTIES_FILE': '/builds/slave/test/buildprops.json', 10:29:11 INFO - 'PWD': '/builds/slave/test', 10:29:11 INFO - 'SHELL': '/bin/bash', 10:29:11 INFO - 'SHLVL': '1', 10:29:11 INFO - 'TERM': 'linux', 10:29:11 INFO - 'TMOUT': '86400', 10:29:11 INFO - 'USER': 'cltbld', 10:29:11 INFO - 'XDG_SESSION_COOKIE': '9ca12473fbb1d023794ffd180000023c-1470245005.707928-777100845', 10:29:11 INFO - '_': '/tools/buildbot/bin/python'} 10:29:11 INFO - Ignoring indexes: https://pypi.python.org/simple/ 10:29:11 INFO - Downloading/unpacking blobuploader==1.2.4 10:29:11 INFO - http://pypi.pvt.build.mozilla.org/pub uses an insecure transport scheme (http). Consider using https if pypi.pvt.build.mozilla.org has it available 10:29:11 INFO - http://pypi.pub.build.mozilla.org/pub uses an insecure transport scheme (http). Consider using https if pypi.pub.build.mozilla.org has it available 10:29:11 INFO - http://pypi.pvt.build.mozilla.org.proxxy1.srv.releng.use1.mozilla.com/pub uses an insecure transport scheme (http). Consider using https if pypi.pvt.build.mozilla.org.proxxy1.srv.releng.use1.mozilla.com has it available 10:29:11 INFO - http://pypi.pub.build.mozilla.org.proxxy1.srv.releng.use1.mozilla.com/pub uses an insecure transport scheme (http). Consider using https if pypi.pub.build.mozilla.org.proxxy1.srv.releng.use1.mozilla.com has it available 10:29:11 INFO - http://pypi.pvt.build.mozilla.org/pub uses an insecure transport scheme (http). Consider using https if pypi.pvt.build.mozilla.org has it available 10:29:11 INFO - http://pypi.pub.build.mozilla.org/pub uses an insecure transport scheme (http). Consider using https if pypi.pub.build.mozilla.org has it available 10:29:16 INFO - Downloading blobuploader-1.2.4.tar.gz 10:29:16 INFO - Running setup.py (path:/builds/slave/test/build/venv/build/blobuploader/setup.py) egg_info for package blobuploader 10:29:16 INFO - Downloading/unpacking requests==1.2.3. (from blobuploader==1.2.4) 10:29:16 INFO - http://pypi.pvt.build.mozilla.org/pub uses an insecure transport scheme (http). Consider using https if pypi.pvt.build.mozilla.org has it available 10:29:16 INFO - http://pypi.pub.build.mozilla.org/pub uses an insecure transport scheme (http). Consider using https if pypi.pub.build.mozilla.org has it available 10:29:16 INFO - http://pypi.pvt.build.mozilla.org.proxxy1.srv.releng.use1.mozilla.com/pub uses an insecure transport scheme (http). Consider using https if pypi.pvt.build.mozilla.org.proxxy1.srv.releng.use1.mozilla.com has it available 10:29:16 INFO - http://pypi.pub.build.mozilla.org.proxxy1.srv.releng.use1.mozilla.com/pub uses an insecure transport scheme (http). Consider using https if pypi.pub.build.mozilla.org.proxxy1.srv.releng.use1.mozilla.com has it available 10:29:16 INFO - http://pypi.pvt.build.mozilla.org/pub uses an insecure transport scheme (http). Consider using https if pypi.pvt.build.mozilla.org has it available 10:29:16 INFO - http://pypi.pub.build.mozilla.org/pub uses an insecure transport scheme (http). Consider using https if pypi.pub.build.mozilla.org has it available 10:29:17 INFO - Running setup.py (path:/builds/slave/test/build/venv/build/requests/setup.py) egg_info for package requests 10:29:18 INFO - Downloading/unpacking docopt==0.6.1 (from blobuploader==1.2.4) 10:29:18 INFO - http://pypi.pvt.build.mozilla.org/pub uses an insecure transport scheme (http). Consider using https if pypi.pvt.build.mozilla.org has it available 10:29:18 INFO - http://pypi.pub.build.mozilla.org/pub uses an insecure transport scheme (http). Consider using https if pypi.pub.build.mozilla.org has it available 10:29:18 INFO - http://pypi.pvt.build.mozilla.org.proxxy1.srv.releng.use1.mozilla.com/pub uses an insecure transport scheme (http). Consider using https if pypi.pvt.build.mozilla.org.proxxy1.srv.releng.use1.mozilla.com has it available 10:29:18 INFO - http://pypi.pub.build.mozilla.org.proxxy1.srv.releng.use1.mozilla.com/pub uses an insecure transport scheme (http). Consider using https if pypi.pub.build.mozilla.org.proxxy1.srv.releng.use1.mozilla.com has it available 10:29:18 INFO - http://pypi.pvt.build.mozilla.org/pub uses an insecure transport scheme (http). Consider using https if pypi.pvt.build.mozilla.org has it available 10:29:18 INFO - http://pypi.pub.build.mozilla.org/pub uses an insecure transport scheme (http). Consider using https if pypi.pub.build.mozilla.org has it available 10:29:18 INFO - Downloading docopt-0.6.1.tar.gz 10:29:18 INFO - Running setup.py (path:/builds/slave/test/build/venv/build/docopt/setup.py) egg_info for package docopt 10:29:18 INFO - Installing collected packages: blobuploader, requests, docopt 10:29:18 INFO - Running setup.py install for blobuploader 10:29:19 INFO - changing mode of build/scripts-2.7/blobberc.py from 664 to 775 10:29:19 INFO - changing mode of /builds/slave/test/build/venv/bin/blobberc.py to 775 10:29:19 INFO - Running setup.py install for requests 10:29:19 INFO - Running setup.py install for docopt 10:29:20 INFO - Successfully installed blobuploader requests docopt 10:29:20 INFO - Cleaning up... 10:29:20 INFO - Return code: 0 10:29:20 INFO - Installing None into virtualenv /builds/slave/test/build/venv 10:29:20 INFO - proxxy config: {'regions': ['.use1.', '.usw2.', '.scl3'], 'instances': ['proxxy1.srv.releng.use1.mozilla.com', 'proxxy1.srv.releng.usw2.mozilla.com', 'proxxy1.srv.releng.scl3.mozilla.com'], 'urls': [('http://ftp.mozilla.org', 'ftp.mozilla.org'), ('https://ftp.mozilla.org', 'ftp.mozilla.org'), ('https://ftp-ssl.mozilla.org', 'ftp.mozilla.org'), ('http://pvtbuilds.pvt.build.mozilla.org', 'pvtbuilds.mozilla.org'), ('http://pypi.pvt.build.mozilla.org', 'pypi.pvt.build.mozilla.org'), ('http://pypi.pub.build.mozilla.org', 'pypi.pub.build.mozilla.org'), ('https://queue.taskcluster.net', 'queue.taskcluster.net')]} 10:29:20 INFO - http://pypi.pvt.build.mozilla.org/pub matches http://pypi.pvt.build.mozilla.org 10:29:20 INFO - URL Candidate: http://pypi.pvt.build.mozilla.org.proxxy1.srv.releng.use1.mozilla.com/pub 10:29:20 INFO - proxxy config: {'regions': ['.use1.', '.usw2.', '.scl3'], 'instances': ['proxxy1.srv.releng.use1.mozilla.com', 'proxxy1.srv.releng.usw2.mozilla.com', 'proxxy1.srv.releng.scl3.mozilla.com'], 'urls': [('http://ftp.mozilla.org', 'ftp.mozilla.org'), ('https://ftp.mozilla.org', 'ftp.mozilla.org'), ('https://ftp-ssl.mozilla.org', 'ftp.mozilla.org'), ('http://pvtbuilds.pvt.build.mozilla.org', 'pvtbuilds.mozilla.org'), ('http://pypi.pvt.build.mozilla.org', 'pypi.pvt.build.mozilla.org'), ('http://pypi.pub.build.mozilla.org', 'pypi.pub.build.mozilla.org'), ('https://queue.taskcluster.net', 'queue.taskcluster.net')]} 10:29:20 INFO - http://pypi.pub.build.mozilla.org/pub matches http://pypi.pub.build.mozilla.org 10:29:20 INFO - URL Candidate: http://pypi.pub.build.mozilla.org.proxxy1.srv.releng.use1.mozilla.com/pub 10:29:20 INFO - retry: Calling run_command with args: [['/builds/slave/test/build/venv/bin/pip', 'install', '--no-deps', '--timeout', '120', '-r', '/builds/slave/test/build/tests/config/mozbase_requirements.txt', '--no-index', '--find-links', 'http://pypi.pvt.build.mozilla.org.proxxy1.srv.releng.use1.mozilla.com/pub', '--find-links', 'http://pypi.pub.build.mozilla.org.proxxy1.srv.releng.use1.mozilla.com/pub', '--find-links', 'http://pypi.pvt.build.mozilla.org/pub', '--find-links', 'http://pypi.pub.build.mozilla.org/pub']], kwargs: {'error_level': 'warning', 'error_list': [{'substr': 'not found or a compiler error:', 'level': 'warning'}, {'regex': <_sre.SRE_Pattern object at 0x21a01f0>, 'level': 'error'}, {'regex': <_sre.SRE_Pattern object at 0x7fbbdf36de40>, 'level': 'warning'}, {'regex': <_sre.SRE_Pattern object at 0x22c3df0>, 'level': 'debug'}, {'substr': 'command not found', 'level': 'error'}, {'regex': <_sre.SRE_Pattern object at 0x22bff90>, 'level': 'warning'}, {'substr': 'Traceback (most recent call last)', 'level': 'error'}, {'substr': 'SyntaxError: ', 'level': 'error'}, {'substr': 'TypeError: ', 'level': 'error'}, {'substr': 'NameError: ', 'level': 'error'}, {'substr': 'ZeroDivisionError: ', 'level': 'error'}, {'regex': <_sre.SRE_Pattern object at 0x22c18f0>, 'level': 'critical'}, {'regex': <_sre.SRE_Pattern object at 0x22c1b70>, 'level': 'critical'}], 'cwd': '/builds/slave/test/build/tests/config', 'env': {'LANG': 'en_US.UTF-8', 'TERM': 'linux', 'SHELL': '/bin/bash', 'XDG_SESSION_COOKIE': '9ca12473fbb1d023794ffd180000023c-1470245005.707928-777100845', 'MAIL': '/var/mail/cltbld', 'SHLVL': '1', 'TMOUT': '86400', 'NODE_PATH': '/usr/lib/nodejs:/usr/lib/node_modules:/usr/share/javascript', 'PWD': '/builds/slave/test', 'LOGNAME': 'cltbld', 'USER': 'cltbld', 'PROPERTIES_FILE': '/builds/slave/test/buildprops.json', 'PATH': '/usr/local/bin:/usr/local/bin:/usr/bin:/bin:/usr/local/games:/usr/games', 'HOME': '/home/cltbld', 'DISPLAY': ':0', '_': '/tools/buildbot/bin/python'}}, attempt #1 10:29:20 INFO - Running command: ['/builds/slave/test/build/venv/bin/pip', 'install', '--no-deps', '--timeout', '120', '-r', '/builds/slave/test/build/tests/config/mozbase_requirements.txt', '--no-index', '--find-links', 'http://pypi.pvt.build.mozilla.org.proxxy1.srv.releng.use1.mozilla.com/pub', '--find-links', 'http://pypi.pub.build.mozilla.org.proxxy1.srv.releng.use1.mozilla.com/pub', '--find-links', 'http://pypi.pvt.build.mozilla.org/pub', '--find-links', 'http://pypi.pub.build.mozilla.org/pub'] in /builds/slave/test/build/tests/config 10:29:20 INFO - Copy/paste: /builds/slave/test/build/venv/bin/pip install --no-deps --timeout 120 -r /builds/slave/test/build/tests/config/mozbase_requirements.txt --no-index --find-links http://pypi.pvt.build.mozilla.org.proxxy1.srv.releng.use1.mozilla.com/pub --find-links http://pypi.pub.build.mozilla.org.proxxy1.srv.releng.use1.mozilla.com/pub --find-links http://pypi.pvt.build.mozilla.org/pub --find-links http://pypi.pub.build.mozilla.org/pub 10:29:20 INFO - Using env: {'DISPLAY': ':0', 10:29:20 INFO - 'HOME': '/home/cltbld', 10:29:20 INFO - 'LANG': 'en_US.UTF-8', 10:29:20 INFO - 'LOGNAME': 'cltbld', 10:29:20 INFO - 'MAIL': '/var/mail/cltbld', 10:29:20 INFO - 'NODE_PATH': '/usr/lib/nodejs:/usr/lib/node_modules:/usr/share/javascript', 10:29:20 INFO - 'PATH': '/usr/local/bin:/usr/local/bin:/usr/bin:/bin:/usr/local/games:/usr/games', 10:29:20 INFO - 'PROPERTIES_FILE': '/builds/slave/test/buildprops.json', 10:29:20 INFO - 'PWD': '/builds/slave/test', 10:29:20 INFO - 'SHELL': '/bin/bash', 10:29:20 INFO - 'SHLVL': '1', 10:29:20 INFO - 'TERM': 'linux', 10:29:20 INFO - 'TMOUT': '86400', 10:29:20 INFO - 'USER': 'cltbld', 10:29:20 INFO - 'XDG_SESSION_COOKIE': '9ca12473fbb1d023794ffd180000023c-1470245005.707928-777100845', 10:29:20 INFO - '_': '/tools/buildbot/bin/python'} 10:29:20 INFO - Ignoring indexes: https://pypi.python.org/simple/ 10:29:20 INFO - Unpacking /builds/slave/test/build/tests/mozbase/manifestparser 10:29:20 INFO - Running setup.py (path:/tmp/pip-cByIKY-build/setup.py) egg_info for package from file:///builds/slave/test/build/tests/mozbase/manifestparser 10:29:20 INFO - Unpacking /builds/slave/test/build/tests/mozbase/mozcrash 10:29:20 INFO - Running setup.py (path:/tmp/pip-Z94mGy-build/setup.py) egg_info for package from file:///builds/slave/test/build/tests/mozbase/mozcrash 10:29:21 INFO - Unpacking /builds/slave/test/build/tests/mozbase/mozdebug 10:29:21 INFO - Running setup.py (path:/tmp/pip-Rt5eXm-build/setup.py) egg_info for package from file:///builds/slave/test/build/tests/mozbase/mozdebug 10:29:21 INFO - Unpacking /builds/slave/test/build/tests/mozbase/mozdevice 10:29:21 INFO - Running setup.py (path:/tmp/pip-SLAgrb-build/setup.py) egg_info for package from file:///builds/slave/test/build/tests/mozbase/mozdevice 10:29:21 INFO - Unpacking /builds/slave/test/build/tests/mozbase/mozfile 10:29:21 INFO - Running setup.py (path:/tmp/pip-OJrPbI-build/setup.py) egg_info for package from file:///builds/slave/test/build/tests/mozbase/mozfile 10:29:21 INFO - Unpacking /builds/slave/test/build/tests/mozbase/mozhttpd 10:29:21 INFO - Running setup.py (path:/tmp/pip-aWSO0d-build/setup.py) egg_info for package from file:///builds/slave/test/build/tests/mozbase/mozhttpd 10:29:21 INFO - Unpacking /builds/slave/test/build/tests/mozbase/mozinfo 10:29:21 INFO - Running setup.py (path:/tmp/pip-Y61TA0-build/setup.py) egg_info for package from file:///builds/slave/test/build/tests/mozbase/mozinfo 10:29:22 INFO - Unpacking /builds/slave/test/build/tests/mozbase/mozinstall 10:29:22 INFO - Running setup.py (path:/tmp/pip-0DN14R-build/setup.py) egg_info for package from file:///builds/slave/test/build/tests/mozbase/mozinstall 10:29:22 INFO - Unpacking /builds/slave/test/build/tests/mozbase/mozleak 10:29:22 INFO - Running setup.py (path:/tmp/pip-HehRI0-build/setup.py) egg_info for package from file:///builds/slave/test/build/tests/mozbase/mozleak 10:29:22 INFO - Unpacking /builds/slave/test/build/tests/mozbase/mozlog 10:29:22 INFO - Running setup.py (path:/tmp/pip-xY6npl-build/setup.py) egg_info for package from file:///builds/slave/test/build/tests/mozbase/mozlog 10:29:22 INFO - Unpacking /builds/slave/test/build/tests/mozbase/moznetwork 10:29:22 INFO - Running setup.py (path:/tmp/pip-cBGeoH-build/setup.py) egg_info for package from file:///builds/slave/test/build/tests/mozbase/moznetwork 10:29:22 INFO - Unpacking /builds/slave/test/build/tests/mozbase/mozprocess 10:29:22 INFO - Running setup.py (path:/tmp/pip-GdwR7t-build/setup.py) egg_info for package from file:///builds/slave/test/build/tests/mozbase/mozprocess 10:29:22 INFO - Unpacking /builds/slave/test/build/tests/mozbase/mozprofile 10:29:22 INFO - Running setup.py (path:/tmp/pip-EePWv_-build/setup.py) egg_info for package from file:///builds/slave/test/build/tests/mozbase/mozprofile 10:29:22 INFO - Unpacking /builds/slave/test/build/tests/mozbase/mozrunner 10:29:22 INFO - Running setup.py (path:/tmp/pip-z7vRBL-build/setup.py) egg_info for package from file:///builds/slave/test/build/tests/mozbase/mozrunner 10:29:22 INFO - Unpacking /builds/slave/test/build/tests/mozbase/mozscreenshot 10:29:22 INFO - Running setup.py (path:/tmp/pip-X6cYDt-build/setup.py) egg_info for package from file:///builds/slave/test/build/tests/mozbase/mozscreenshot 10:29:23 INFO - Unpacking /builds/slave/test/build/tests/mozbase/moztest 10:29:23 INFO - Running setup.py (path:/tmp/pip-3PMZZM-build/setup.py) egg_info for package from file:///builds/slave/test/build/tests/mozbase/moztest 10:29:23 INFO - Unpacking /builds/slave/test/build/tests/mozbase/mozversion 10:29:23 INFO - Running setup.py (path:/tmp/pip-pU_a5_-build/setup.py) egg_info for package from file:///builds/slave/test/build/tests/mozbase/mozversion 10:29:23 INFO - Installing collected packages: manifestparser, mozcrash, mozdebug, mozdevice, mozfile, mozhttpd, mozinfo, mozInstall, mozleak, mozlog, moznetwork, mozprocess, mozprofile, mozrunner, mozscreenshot, moztest, mozversion 10:29:23 INFO - Running setup.py install for manifestparser 10:29:23 INFO - Installing manifestparser script to /builds/slave/test/build/venv/bin 10:29:23 INFO - Running setup.py install for mozcrash 10:29:23 INFO - Running setup.py install for mozdebug 10:29:23 INFO - Running setup.py install for mozdevice 10:29:24 INFO - Installing sutini script to /builds/slave/test/build/venv/bin 10:29:24 INFO - Installing dm script to /builds/slave/test/build/venv/bin 10:29:24 INFO - Running setup.py install for mozfile 10:29:24 INFO - Running setup.py install for mozhttpd 10:29:24 INFO - Installing mozhttpd script to /builds/slave/test/build/venv/bin 10:29:24 INFO - Running setup.py install for mozinfo 10:29:24 INFO - Installing mozinfo script to /builds/slave/test/build/venv/bin 10:29:24 INFO - Running setup.py install for mozInstall 10:29:24 INFO - Installing moz_remove_from_system script to /builds/slave/test/build/venv/bin 10:29:24 INFO - Installing mozuninstall script to /builds/slave/test/build/venv/bin 10:29:24 INFO - Installing mozinstall script to /builds/slave/test/build/venv/bin 10:29:24 INFO - Installing moz_add_to_system script to /builds/slave/test/build/venv/bin 10:29:24 INFO - Running setup.py install for mozleak 10:29:25 INFO - Running setup.py install for mozlog 10:29:25 INFO - Installing structlog script to /builds/slave/test/build/venv/bin 10:29:25 INFO - Running setup.py install for moznetwork 10:29:25 INFO - Installing moznetwork script to /builds/slave/test/build/venv/bin 10:29:25 INFO - Running setup.py install for mozprocess 10:29:25 INFO - Running setup.py install for mozprofile 10:29:26 INFO - Installing mozprofile script to /builds/slave/test/build/venv/bin 10:29:26 INFO - Installing diff-profiles script to /builds/slave/test/build/venv/bin 10:29:26 INFO - Installing view-profile script to /builds/slave/test/build/venv/bin 10:29:26 INFO - Running setup.py install for mozrunner 10:29:26 INFO - Installing mozrunner script to /builds/slave/test/build/venv/bin 10:29:26 INFO - Running setup.py install for mozscreenshot 10:29:26 INFO - Running setup.py install for moztest 10:29:26 INFO - Running setup.py install for mozversion 10:29:26 INFO - Installing mozversion script to /builds/slave/test/build/venv/bin 10:29:26 INFO - Successfully installed manifestparser mozcrash mozdebug mozdevice mozfile mozhttpd mozinfo mozInstall mozleak mozlog moznetwork mozprocess mozprofile mozrunner mozscreenshot moztest mozversion 10:29:26 INFO - Cleaning up... 10:29:26 INFO - Return code: 0 10:29:26 INFO - Installing None into virtualenv /builds/slave/test/build/venv 10:29:26 INFO - proxxy config: {'regions': ['.use1.', '.usw2.', '.scl3'], 'instances': ['proxxy1.srv.releng.use1.mozilla.com', 'proxxy1.srv.releng.usw2.mozilla.com', 'proxxy1.srv.releng.scl3.mozilla.com'], 'urls': [('http://ftp.mozilla.org', 'ftp.mozilla.org'), ('https://ftp.mozilla.org', 'ftp.mozilla.org'), ('https://ftp-ssl.mozilla.org', 'ftp.mozilla.org'), ('http://pvtbuilds.pvt.build.mozilla.org', 'pvtbuilds.mozilla.org'), ('http://pypi.pvt.build.mozilla.org', 'pypi.pvt.build.mozilla.org'), ('http://pypi.pub.build.mozilla.org', 'pypi.pub.build.mozilla.org'), ('https://queue.taskcluster.net', 'queue.taskcluster.net')]} 10:29:26 INFO - http://pypi.pvt.build.mozilla.org/pub matches http://pypi.pvt.build.mozilla.org 10:29:26 INFO - URL Candidate: http://pypi.pvt.build.mozilla.org.proxxy1.srv.releng.use1.mozilla.com/pub 10:29:26 INFO - proxxy config: {'regions': ['.use1.', '.usw2.', '.scl3'], 'instances': ['proxxy1.srv.releng.use1.mozilla.com', 'proxxy1.srv.releng.usw2.mozilla.com', 'proxxy1.srv.releng.scl3.mozilla.com'], 'urls': [('http://ftp.mozilla.org', 'ftp.mozilla.org'), ('https://ftp.mozilla.org', 'ftp.mozilla.org'), ('https://ftp-ssl.mozilla.org', 'ftp.mozilla.org'), ('http://pvtbuilds.pvt.build.mozilla.org', 'pvtbuilds.mozilla.org'), ('http://pypi.pvt.build.mozilla.org', 'pypi.pvt.build.mozilla.org'), ('http://pypi.pub.build.mozilla.org', 'pypi.pub.build.mozilla.org'), ('https://queue.taskcluster.net', 'queue.taskcluster.net')]} 10:29:26 INFO - http://pypi.pub.build.mozilla.org/pub matches http://pypi.pub.build.mozilla.org 10:29:26 INFO - URL Candidate: http://pypi.pub.build.mozilla.org.proxxy1.srv.releng.use1.mozilla.com/pub 10:29:26 INFO - retry: Calling run_command with args: [['/builds/slave/test/build/venv/bin/pip', 'install', '--timeout', '120', '-r', '/builds/slave/test/build/tests/config/mozbase_requirements.txt', '--no-index', '--find-links', 'http://pypi.pvt.build.mozilla.org.proxxy1.srv.releng.use1.mozilla.com/pub', '--find-links', 'http://pypi.pub.build.mozilla.org.proxxy1.srv.releng.use1.mozilla.com/pub', '--find-links', 'http://pypi.pvt.build.mozilla.org/pub', '--find-links', 'http://pypi.pub.build.mozilla.org/pub']], kwargs: {'error_level': 'warning', 'error_list': [{'substr': 'not found or a compiler error:', 'level': 'warning'}, {'regex': <_sre.SRE_Pattern object at 0x21a01f0>, 'level': 'error'}, {'regex': <_sre.SRE_Pattern object at 0x7fbbdf36de40>, 'level': 'warning'}, {'regex': <_sre.SRE_Pattern object at 0x22c3df0>, 'level': 'debug'}, {'substr': 'command not found', 'level': 'error'}, {'regex': <_sre.SRE_Pattern object at 0x22bff90>, 'level': 'warning'}, {'substr': 'Traceback (most recent call last)', 'level': 'error'}, {'substr': 'SyntaxError: ', 'level': 'error'}, {'substr': 'TypeError: ', 'level': 'error'}, {'substr': 'NameError: ', 'level': 'error'}, {'substr': 'ZeroDivisionError: ', 'level': 'error'}, {'regex': <_sre.SRE_Pattern object at 0x22c18f0>, 'level': 'critical'}, {'regex': <_sre.SRE_Pattern object at 0x22c1b70>, 'level': 'critical'}], 'cwd': '/builds/slave/test/build/tests/config', 'env': {'LANG': 'en_US.UTF-8', 'TERM': 'linux', 'SHELL': '/bin/bash', 'XDG_SESSION_COOKIE': '9ca12473fbb1d023794ffd180000023c-1470245005.707928-777100845', 'MAIL': '/var/mail/cltbld', 'SHLVL': '1', 'TMOUT': '86400', 'NODE_PATH': '/usr/lib/nodejs:/usr/lib/node_modules:/usr/share/javascript', 'PWD': '/builds/slave/test', 'LOGNAME': 'cltbld', 'USER': 'cltbld', 'PROPERTIES_FILE': '/builds/slave/test/buildprops.json', 'PATH': '/usr/local/bin:/usr/local/bin:/usr/bin:/bin:/usr/local/games:/usr/games', 'HOME': '/home/cltbld', 'DISPLAY': ':0', '_': '/tools/buildbot/bin/python'}}, attempt #1 10:29:26 INFO - Running command: ['/builds/slave/test/build/venv/bin/pip', 'install', '--timeout', '120', '-r', '/builds/slave/test/build/tests/config/mozbase_requirements.txt', '--no-index', '--find-links', 'http://pypi.pvt.build.mozilla.org.proxxy1.srv.releng.use1.mozilla.com/pub', '--find-links', 'http://pypi.pub.build.mozilla.org.proxxy1.srv.releng.use1.mozilla.com/pub', '--find-links', 'http://pypi.pvt.build.mozilla.org/pub', '--find-links', 'http://pypi.pub.build.mozilla.org/pub'] in /builds/slave/test/build/tests/config 10:29:26 INFO - Copy/paste: /builds/slave/test/build/venv/bin/pip install --timeout 120 -r /builds/slave/test/build/tests/config/mozbase_requirements.txt --no-index --find-links http://pypi.pvt.build.mozilla.org.proxxy1.srv.releng.use1.mozilla.com/pub --find-links http://pypi.pub.build.mozilla.org.proxxy1.srv.releng.use1.mozilla.com/pub --find-links http://pypi.pvt.build.mozilla.org/pub --find-links http://pypi.pub.build.mozilla.org/pub 10:29:26 INFO - Using env: {'DISPLAY': ':0', 10:29:26 INFO - 'HOME': '/home/cltbld', 10:29:26 INFO - 'LANG': 'en_US.UTF-8', 10:29:26 INFO - 'LOGNAME': 'cltbld', 10:29:26 INFO - 'MAIL': '/var/mail/cltbld', 10:29:26 INFO - 'NODE_PATH': '/usr/lib/nodejs:/usr/lib/node_modules:/usr/share/javascript', 10:29:26 INFO - 'PATH': '/usr/local/bin:/usr/local/bin:/usr/bin:/bin:/usr/local/games:/usr/games', 10:29:26 INFO - 'PROPERTIES_FILE': '/builds/slave/test/buildprops.json', 10:29:26 INFO - 'PWD': '/builds/slave/test', 10:29:26 INFO - 'SHELL': '/bin/bash', 10:29:26 INFO - 'SHLVL': '1', 10:29:26 INFO - 'TERM': 'linux', 10:29:26 INFO - 'TMOUT': '86400', 10:29:26 INFO - 'USER': 'cltbld', 10:29:26 INFO - 'XDG_SESSION_COOKIE': '9ca12473fbb1d023794ffd180000023c-1470245005.707928-777100845', 10:29:26 INFO - '_': '/tools/buildbot/bin/python'} 10:29:27 INFO - Ignoring indexes: https://pypi.python.org/simple/ 10:29:27 INFO - Unpacking /builds/slave/test/build/tests/mozbase/manifestparser 10:29:27 INFO - Running setup.py (path:/tmp/pip-XbCXTc-build/setup.py) egg_info for package from file:///builds/slave/test/build/tests/mozbase/manifestparser 10:29:27 INFO - Requirement already satisfied (use --upgrade to upgrade): manifestparser==1.1 from file:///builds/slave/test/build/tests/mozbase/manifestparser in /builds/slave/test/build/venv/lib/python2.7/site-packages (from -r /builds/slave/test/build/tests/config/mozbase_requirements.txt (line 1)) 10:29:27 INFO - Unpacking /builds/slave/test/build/tests/mozbase/mozcrash 10:29:27 INFO - Running setup.py (path:/tmp/pip-uNkEnP-build/setup.py) egg_info for package from file:///builds/slave/test/build/tests/mozbase/mozcrash 10:29:27 INFO - Requirement already satisfied (use --upgrade to upgrade): mozcrash==0.17 from file:///builds/slave/test/build/tests/mozbase/mozcrash in /builds/slave/test/build/venv/lib/python2.7/site-packages (from -r /builds/slave/test/build/tests/config/mozbase_requirements.txt (line 2)) 10:29:27 INFO - Unpacking /builds/slave/test/build/tests/mozbase/mozdebug 10:29:27 INFO - Running setup.py (path:/tmp/pip-lX07DK-build/setup.py) egg_info for package from file:///builds/slave/test/build/tests/mozbase/mozdebug 10:29:27 INFO - Requirement already satisfied (use --upgrade to upgrade): mozdebug==0.1 from file:///builds/slave/test/build/tests/mozbase/mozdebug in /builds/slave/test/build/venv/lib/python2.7/site-packages (from -r /builds/slave/test/build/tests/config/mozbase_requirements.txt (line 3)) 10:29:27 INFO - Unpacking /builds/slave/test/build/tests/mozbase/mozdevice 10:29:27 INFO - Running setup.py (path:/tmp/pip-x52F_P-build/setup.py) egg_info for package from file:///builds/slave/test/build/tests/mozbase/mozdevice 10:29:27 INFO - Requirement already satisfied (use --upgrade to upgrade): mozdevice==0.48 from file:///builds/slave/test/build/tests/mozbase/mozdevice in /builds/slave/test/build/venv/lib/python2.7/site-packages (from -r /builds/slave/test/build/tests/config/mozbase_requirements.txt (line 4)) 10:29:27 INFO - Unpacking /builds/slave/test/build/tests/mozbase/mozfile 10:29:27 INFO - Running setup.py (path:/tmp/pip-AZvWTS-build/setup.py) egg_info for package from file:///builds/slave/test/build/tests/mozbase/mozfile 10:29:28 INFO - Requirement already satisfied (use --upgrade to upgrade): mozfile==1.2 from file:///builds/slave/test/build/tests/mozbase/mozfile in /builds/slave/test/build/venv/lib/python2.7/site-packages (from -r /builds/slave/test/build/tests/config/mozbase_requirements.txt (line 5)) 10:29:28 INFO - Unpacking /builds/slave/test/build/tests/mozbase/mozhttpd 10:29:28 INFO - Running setup.py (path:/tmp/pip-tIULGN-build/setup.py) egg_info for package from file:///builds/slave/test/build/tests/mozbase/mozhttpd 10:29:28 INFO - Requirement already satisfied (use --upgrade to upgrade): mozhttpd==0.7 from file:///builds/slave/test/build/tests/mozbase/mozhttpd in /builds/slave/test/build/venv/lib/python2.7/site-packages (from -r /builds/slave/test/build/tests/config/mozbase_requirements.txt (line 6)) 10:29:28 INFO - Unpacking /builds/slave/test/build/tests/mozbase/mozinfo 10:29:28 INFO - Running setup.py (path:/tmp/pip-xgr3Bi-build/setup.py) egg_info for package from file:///builds/slave/test/build/tests/mozbase/mozinfo 10:29:28 INFO - Requirement already satisfied (use --upgrade to upgrade): mozinfo==0.9 from file:///builds/slave/test/build/tests/mozbase/mozinfo in /builds/slave/test/build/venv/lib/python2.7/site-packages (from -r /builds/slave/test/build/tests/config/mozbase_requirements.txt (line 7)) 10:29:28 INFO - Unpacking /builds/slave/test/build/tests/mozbase/mozinstall 10:29:28 INFO - Running setup.py (path:/tmp/pip-pWfL9e-build/setup.py) egg_info for package from file:///builds/slave/test/build/tests/mozbase/mozinstall 10:29:28 INFO - Requirement already satisfied (use --upgrade to upgrade): mozInstall==1.12 from file:///builds/slave/test/build/tests/mozbase/mozinstall in /builds/slave/test/build/venv/lib/python2.7/site-packages (from -r /builds/slave/test/build/tests/config/mozbase_requirements.txt (line 8)) 10:29:28 INFO - Unpacking /builds/slave/test/build/tests/mozbase/mozleak 10:29:28 INFO - Running setup.py (path:/tmp/pip-6kCFrl-build/setup.py) egg_info for package from file:///builds/slave/test/build/tests/mozbase/mozleak 10:29:28 INFO - Requirement already satisfied (use --upgrade to upgrade): mozleak==0.1 from file:///builds/slave/test/build/tests/mozbase/mozleak in /builds/slave/test/build/venv/lib/python2.7/site-packages (from -r /builds/slave/test/build/tests/config/mozbase_requirements.txt (line 9)) 10:29:28 INFO - Unpacking /builds/slave/test/build/tests/mozbase/mozlog 10:29:28 INFO - Running setup.py (path:/tmp/pip-PzwSkp-build/setup.py) egg_info for package from file:///builds/slave/test/build/tests/mozbase/mozlog 10:29:28 INFO - Requirement already satisfied (use --upgrade to upgrade): mozlog==3.3 from file:///builds/slave/test/build/tests/mozbase/mozlog in /builds/slave/test/build/venv/lib/python2.7/site-packages (from -r /builds/slave/test/build/tests/config/mozbase_requirements.txt (line 10)) 10:29:28 INFO - Unpacking /builds/slave/test/build/tests/mozbase/moznetwork 10:29:28 INFO - Running setup.py (path:/tmp/pip-0VexR7-build/setup.py) egg_info for package from file:///builds/slave/test/build/tests/mozbase/moznetwork 10:29:28 INFO - Requirement already satisfied (use --upgrade to upgrade): moznetwork==0.27 from file:///builds/slave/test/build/tests/mozbase/moznetwork in /builds/slave/test/build/venv/lib/python2.7/site-packages (from -r /builds/slave/test/build/tests/config/mozbase_requirements.txt (line 11)) 10:29:28 INFO - Unpacking /builds/slave/test/build/tests/mozbase/mozprocess 10:29:28 INFO - Running setup.py (path:/tmp/pip-EEyUFr-build/setup.py) egg_info for package from file:///builds/slave/test/build/tests/mozbase/mozprocess 10:29:29 INFO - Requirement already satisfied (use --upgrade to upgrade): mozprocess==0.23 from file:///builds/slave/test/build/tests/mozbase/mozprocess in /builds/slave/test/build/venv/lib/python2.7/site-packages (from -r /builds/slave/test/build/tests/config/mozbase_requirements.txt (line 12)) 10:29:29 INFO - Unpacking /builds/slave/test/build/tests/mozbase/mozprofile 10:29:29 INFO - Running setup.py (path:/tmp/pip-emoyEY-build/setup.py) egg_info for package from file:///builds/slave/test/build/tests/mozbase/mozprofile 10:29:29 INFO - Requirement already satisfied (use --upgrade to upgrade): mozprofile==0.28 from file:///builds/slave/test/build/tests/mozbase/mozprofile in /builds/slave/test/build/venv/lib/python2.7/site-packages (from -r /builds/slave/test/build/tests/config/mozbase_requirements.txt (line 13)) 10:29:29 INFO - Unpacking /builds/slave/test/build/tests/mozbase/mozrunner 10:29:29 INFO - Running setup.py (path:/tmp/pip-Wz9ISl-build/setup.py) egg_info for package from file:///builds/slave/test/build/tests/mozbase/mozrunner 10:29:29 INFO - Requirement already satisfied (use --upgrade to upgrade): mozrunner==6.12 from file:///builds/slave/test/build/tests/mozbase/mozrunner in /builds/slave/test/build/venv/lib/python2.7/site-packages (from -r /builds/slave/test/build/tests/config/mozbase_requirements.txt (line 14)) 10:29:29 INFO - Unpacking /builds/slave/test/build/tests/mozbase/mozscreenshot 10:29:29 INFO - Running setup.py (path:/tmp/pip-Itlml8-build/setup.py) egg_info for package from file:///builds/slave/test/build/tests/mozbase/mozscreenshot 10:29:29 INFO - Requirement already satisfied (use --upgrade to upgrade): mozscreenshot==0.1 from file:///builds/slave/test/build/tests/mozbase/mozscreenshot in /builds/slave/test/build/venv/lib/python2.7/site-packages (from -r /builds/slave/test/build/tests/config/mozbase_requirements.txt (line 15)) 10:29:29 INFO - Unpacking /builds/slave/test/build/tests/mozbase/moztest 10:29:29 INFO - Running setup.py (path:/tmp/pip-95oyE9-build/setup.py) egg_info for package from file:///builds/slave/test/build/tests/mozbase/moztest 10:29:29 INFO - Requirement already satisfied (use --upgrade to upgrade): moztest==0.7 from file:///builds/slave/test/build/tests/mozbase/moztest in /builds/slave/test/build/venv/lib/python2.7/site-packages (from -r /builds/slave/test/build/tests/config/mozbase_requirements.txt (line 16)) 10:29:29 INFO - Unpacking /builds/slave/test/build/tests/mozbase/mozversion 10:29:29 INFO - Running setup.py (path:/tmp/pip-u2rIrl-build/setup.py) egg_info for package from file:///builds/slave/test/build/tests/mozbase/mozversion 10:29:29 INFO - Requirement already satisfied (use --upgrade to upgrade): mozversion==1.4 from file:///builds/slave/test/build/tests/mozbase/mozversion in /builds/slave/test/build/venv/lib/python2.7/site-packages (from -r /builds/slave/test/build/tests/config/mozbase_requirements.txt (line 17)) 10:29:29 INFO - Requirement already satisfied (use --upgrade to upgrade): mozfile>=1.0 in /builds/slave/test/build/venv/lib/python2.7/site-packages (from mozcrash==0.17->-r /builds/slave/test/build/tests/config/mozbase_requirements.txt (line 2)) 10:29:29 INFO - Requirement already satisfied (use --upgrade to upgrade): mozlog>=3.0 in /builds/slave/test/build/venv/lib/python2.7/site-packages (from mozcrash==0.17->-r /builds/slave/test/build/tests/config/mozbase_requirements.txt (line 2)) 10:29:29 INFO - Requirement already satisfied (use --upgrade to upgrade): mozinfo in /builds/slave/test/build/venv/lib/python2.7/site-packages (from mozdebug==0.1->-r /builds/slave/test/build/tests/config/mozbase_requirements.txt (line 3)) 10:29:29 INFO - Requirement already satisfied (use --upgrade to upgrade): moznetwork>=0.24 in /builds/slave/test/build/venv/lib/python2.7/site-packages (from mozdevice==0.48->-r /builds/slave/test/build/tests/config/mozbase_requirements.txt (line 4)) 10:29:29 INFO - Requirement already satisfied (use --upgrade to upgrade): mozprocess>=0.19 in /builds/slave/test/build/venv/lib/python2.7/site-packages (from mozdevice==0.48->-r /builds/slave/test/build/tests/config/mozbase_requirements.txt (line 4)) 10:29:29 INFO - Downloading/unpacking blessings>=1.3 (from mozlog==3.3->-r /builds/slave/test/build/tests/config/mozbase_requirements.txt (line 10)) 10:29:29 INFO - http://pypi.pvt.build.mozilla.org/pub uses an insecure transport scheme (http). Consider using https if pypi.pvt.build.mozilla.org has it available 10:29:29 INFO - http://pypi.pub.build.mozilla.org/pub uses an insecure transport scheme (http). Consider using https if pypi.pub.build.mozilla.org has it available 10:29:29 INFO - http://pypi.pvt.build.mozilla.org.proxxy1.srv.releng.use1.mozilla.com/pub uses an insecure transport scheme (http). Consider using https if pypi.pvt.build.mozilla.org.proxxy1.srv.releng.use1.mozilla.com has it available 10:29:29 INFO - http://pypi.pub.build.mozilla.org.proxxy1.srv.releng.use1.mozilla.com/pub uses an insecure transport scheme (http). Consider using https if pypi.pub.build.mozilla.org.proxxy1.srv.releng.use1.mozilla.com has it available 10:29:29 INFO - http://pypi.pvt.build.mozilla.org/pub uses an insecure transport scheme (http). Consider using https if pypi.pvt.build.mozilla.org has it available 10:29:29 INFO - http://pypi.pub.build.mozilla.org/pub uses an insecure transport scheme (http). Consider using https if pypi.pub.build.mozilla.org has it available 10:29:34 INFO - Downloading blessings-1.6.tar.gz 10:29:34 INFO - Running setup.py (path:/builds/slave/test/build/venv/build/blessings/setup.py) egg_info for package blessings 10:29:34 INFO - Installing collected packages: blessings 10:29:34 INFO - Running setup.py install for blessings 10:29:35 INFO - Successfully installed blessings 10:29:35 INFO - Cleaning up... 10:29:35 INFO - Return code: 0 10:29:35 INFO - Installing pip>=1.5 into virtualenv /builds/slave/test/build/venv 10:29:35 INFO - proxxy config: {'regions': ['.use1.', '.usw2.', '.scl3'], 'instances': ['proxxy1.srv.releng.use1.mozilla.com', 'proxxy1.srv.releng.usw2.mozilla.com', 'proxxy1.srv.releng.scl3.mozilla.com'], 'urls': [('http://ftp.mozilla.org', 'ftp.mozilla.org'), ('https://ftp.mozilla.org', 'ftp.mozilla.org'), ('https://ftp-ssl.mozilla.org', 'ftp.mozilla.org'), ('http://pvtbuilds.pvt.build.mozilla.org', 'pvtbuilds.mozilla.org'), ('http://pypi.pvt.build.mozilla.org', 'pypi.pvt.build.mozilla.org'), ('http://pypi.pub.build.mozilla.org', 'pypi.pub.build.mozilla.org'), ('https://queue.taskcluster.net', 'queue.taskcluster.net')]} 10:29:35 INFO - http://pypi.pvt.build.mozilla.org/pub matches http://pypi.pvt.build.mozilla.org 10:29:35 INFO - URL Candidate: http://pypi.pvt.build.mozilla.org.proxxy1.srv.releng.use1.mozilla.com/pub 10:29:35 INFO - proxxy config: {'regions': ['.use1.', '.usw2.', '.scl3'], 'instances': ['proxxy1.srv.releng.use1.mozilla.com', 'proxxy1.srv.releng.usw2.mozilla.com', 'proxxy1.srv.releng.scl3.mozilla.com'], 'urls': [('http://ftp.mozilla.org', 'ftp.mozilla.org'), ('https://ftp.mozilla.org', 'ftp.mozilla.org'), ('https://ftp-ssl.mozilla.org', 'ftp.mozilla.org'), ('http://pvtbuilds.pvt.build.mozilla.org', 'pvtbuilds.mozilla.org'), ('http://pypi.pvt.build.mozilla.org', 'pypi.pvt.build.mozilla.org'), ('http://pypi.pub.build.mozilla.org', 'pypi.pub.build.mozilla.org'), ('https://queue.taskcluster.net', 'queue.taskcluster.net')]} 10:29:35 INFO - http://pypi.pub.build.mozilla.org/pub matches http://pypi.pub.build.mozilla.org 10:29:35 INFO - URL Candidate: http://pypi.pub.build.mozilla.org.proxxy1.srv.releng.use1.mozilla.com/pub 10:29:35 INFO - retry: Calling run_command with args: [['/builds/slave/test/build/venv/bin/pip', 'install', '--timeout', '120', '--no-index', '--find-links', 'http://pypi.pvt.build.mozilla.org.proxxy1.srv.releng.use1.mozilla.com/pub', '--find-links', 'http://pypi.pub.build.mozilla.org.proxxy1.srv.releng.use1.mozilla.com/pub', '--find-links', 'http://pypi.pvt.build.mozilla.org/pub', '--find-links', 'http://pypi.pub.build.mozilla.org/pub', 'pip>=1.5']], kwargs: {'error_level': 'warning', 'error_list': [{'substr': 'not found or a compiler error:', 'level': 'warning'}, {'regex': <_sre.SRE_Pattern object at 0x21a01f0>, 'level': 'error'}, {'regex': <_sre.SRE_Pattern object at 0x7fbbdf36de40>, 'level': 'warning'}, {'regex': <_sre.SRE_Pattern object at 0x22c3df0>, 'level': 'debug'}, {'substr': 'command not found', 'level': 'error'}, {'regex': <_sre.SRE_Pattern object at 0x22bff90>, 'level': 'warning'}, {'substr': 'Traceback (most recent call last)', 'level': 'error'}, {'substr': 'SyntaxError: ', 'level': 'error'}, {'substr': 'TypeError: ', 'level': 'error'}, {'substr': 'NameError: ', 'level': 'error'}, {'substr': 'ZeroDivisionError: ', 'level': 'error'}, {'regex': <_sre.SRE_Pattern object at 0x22c18f0>, 'level': 'critical'}, {'regex': <_sre.SRE_Pattern object at 0x22c1b70>, 'level': 'critical'}], 'cwd': '/builds/slave/test/build', 'env': {'LANG': 'en_US.UTF-8', 'TERM': 'linux', 'SHELL': '/bin/bash', 'XDG_SESSION_COOKIE': '9ca12473fbb1d023794ffd180000023c-1470245005.707928-777100845', 'MAIL': '/var/mail/cltbld', 'SHLVL': '1', 'TMOUT': '86400', 'NODE_PATH': '/usr/lib/nodejs:/usr/lib/node_modules:/usr/share/javascript', 'PWD': '/builds/slave/test', 'LOGNAME': 'cltbld', 'USER': 'cltbld', 'PROPERTIES_FILE': '/builds/slave/test/buildprops.json', 'PATH': '/usr/local/bin:/usr/local/bin:/usr/bin:/bin:/usr/local/games:/usr/games', 'HOME': '/home/cltbld', 'DISPLAY': ':0', '_': '/tools/buildbot/bin/python'}}, attempt #1 10:29:35 INFO - Running command: ['/builds/slave/test/build/venv/bin/pip', 'install', '--timeout', '120', '--no-index', '--find-links', 'http://pypi.pvt.build.mozilla.org.proxxy1.srv.releng.use1.mozilla.com/pub', '--find-links', 'http://pypi.pub.build.mozilla.org.proxxy1.srv.releng.use1.mozilla.com/pub', '--find-links', 'http://pypi.pvt.build.mozilla.org/pub', '--find-links', 'http://pypi.pub.build.mozilla.org/pub', 'pip>=1.5'] in /builds/slave/test/build 10:29:35 INFO - Copy/paste: /builds/slave/test/build/venv/bin/pip install --timeout 120 --no-index --find-links http://pypi.pvt.build.mozilla.org.proxxy1.srv.releng.use1.mozilla.com/pub --find-links http://pypi.pub.build.mozilla.org.proxxy1.srv.releng.use1.mozilla.com/pub --find-links http://pypi.pvt.build.mozilla.org/pub --find-links http://pypi.pub.build.mozilla.org/pub pip>=1.5 10:29:35 INFO - Using env: {'DISPLAY': ':0', 10:29:35 INFO - 'HOME': '/home/cltbld', 10:29:35 INFO - 'LANG': 'en_US.UTF-8', 10:29:35 INFO - 'LOGNAME': 'cltbld', 10:29:35 INFO - 'MAIL': '/var/mail/cltbld', 10:29:35 INFO - 'NODE_PATH': '/usr/lib/nodejs:/usr/lib/node_modules:/usr/share/javascript', 10:29:35 INFO - 'PATH': '/usr/local/bin:/usr/local/bin:/usr/bin:/bin:/usr/local/games:/usr/games', 10:29:35 INFO - 'PROPERTIES_FILE': '/builds/slave/test/buildprops.json', 10:29:35 INFO - 'PWD': '/builds/slave/test', 10:29:35 INFO - 'SHELL': '/bin/bash', 10:29:35 INFO - 'SHLVL': '1', 10:29:35 INFO - 'TERM': 'linux', 10:29:35 INFO - 'TMOUT': '86400', 10:29:35 INFO - 'USER': 'cltbld', 10:29:35 INFO - 'XDG_SESSION_COOKIE': '9ca12473fbb1d023794ffd180000023c-1470245005.707928-777100845', 10:29:35 INFO - '_': '/tools/buildbot/bin/python'} 10:29:35 INFO - Ignoring indexes: https://pypi.python.org/simple/ 10:29:35 INFO - Requirement already satisfied (use --upgrade to upgrade): pip>=1.5 in ./venv/lib/python2.7/site-packages/pip-1.5.5-py2.7.egg 10:29:35 INFO - Cleaning up... 10:29:35 INFO - Return code: 0 10:29:35 INFO - Installing psutil==3.1.1 into virtualenv /builds/slave/test/build/venv 10:29:35 INFO - proxxy config: {'regions': ['.use1.', '.usw2.', '.scl3'], 'instances': ['proxxy1.srv.releng.use1.mozilla.com', 'proxxy1.srv.releng.usw2.mozilla.com', 'proxxy1.srv.releng.scl3.mozilla.com'], 'urls': [('http://ftp.mozilla.org', 'ftp.mozilla.org'), ('https://ftp.mozilla.org', 'ftp.mozilla.org'), ('https://ftp-ssl.mozilla.org', 'ftp.mozilla.org'), ('http://pvtbuilds.pvt.build.mozilla.org', 'pvtbuilds.mozilla.org'), ('http://pypi.pvt.build.mozilla.org', 'pypi.pvt.build.mozilla.org'), ('http://pypi.pub.build.mozilla.org', 'pypi.pub.build.mozilla.org'), ('https://queue.taskcluster.net', 'queue.taskcluster.net')]} 10:29:35 INFO - http://pypi.pvt.build.mozilla.org/pub matches http://pypi.pvt.build.mozilla.org 10:29:35 INFO - URL Candidate: http://pypi.pvt.build.mozilla.org.proxxy1.srv.releng.use1.mozilla.com/pub 10:29:35 INFO - proxxy config: {'regions': ['.use1.', '.usw2.', '.scl3'], 'instances': ['proxxy1.srv.releng.use1.mozilla.com', 'proxxy1.srv.releng.usw2.mozilla.com', 'proxxy1.srv.releng.scl3.mozilla.com'], 'urls': [('http://ftp.mozilla.org', 'ftp.mozilla.org'), ('https://ftp.mozilla.org', 'ftp.mozilla.org'), ('https://ftp-ssl.mozilla.org', 'ftp.mozilla.org'), ('http://pvtbuilds.pvt.build.mozilla.org', 'pvtbuilds.mozilla.org'), ('http://pypi.pvt.build.mozilla.org', 'pypi.pvt.build.mozilla.org'), ('http://pypi.pub.build.mozilla.org', 'pypi.pub.build.mozilla.org'), ('https://queue.taskcluster.net', 'queue.taskcluster.net')]} 10:29:35 INFO - http://pypi.pub.build.mozilla.org/pub matches http://pypi.pub.build.mozilla.org 10:29:35 INFO - URL Candidate: http://pypi.pub.build.mozilla.org.proxxy1.srv.releng.use1.mozilla.com/pub 10:29:35 INFO - retry: Calling run_command with args: [['/builds/slave/test/build/venv/bin/pip', 'install', '--timeout', '120', '--no-index', '--find-links', 'http://pypi.pvt.build.mozilla.org.proxxy1.srv.releng.use1.mozilla.com/pub', '--find-links', 'http://pypi.pub.build.mozilla.org.proxxy1.srv.releng.use1.mozilla.com/pub', '--find-links', 'http://pypi.pvt.build.mozilla.org/pub', '--find-links', 'http://pypi.pub.build.mozilla.org/pub', 'psutil==3.1.1']], kwargs: {'error_level': 'warning', 'error_list': [{'substr': 'not found or a compiler error:', 'level': 'warning'}, {'regex': <_sre.SRE_Pattern object at 0x21a01f0>, 'level': 'error'}, {'regex': <_sre.SRE_Pattern object at 0x7fbbdf36de40>, 'level': 'warning'}, {'regex': <_sre.SRE_Pattern object at 0x22c3df0>, 'level': 'debug'}, {'substr': 'command not found', 'level': 'error'}, {'regex': <_sre.SRE_Pattern object at 0x22bff90>, 'level': 'warning'}, {'substr': 'Traceback (most recent call last)', 'level': 'error'}, {'substr': 'SyntaxError: ', 'level': 'error'}, {'substr': 'TypeError: ', 'level': 'error'}, {'substr': 'NameError: ', 'level': 'error'}, {'substr': 'ZeroDivisionError: ', 'level': 'error'}, {'regex': <_sre.SRE_Pattern object at 0x22c18f0>, 'level': 'critical'}, {'regex': <_sre.SRE_Pattern object at 0x22c1b70>, 'level': 'critical'}], 'cwd': '/builds/slave/test/build', 'env': {'LANG': 'en_US.UTF-8', 'TERM': 'linux', 'SHELL': '/bin/bash', 'XDG_SESSION_COOKIE': '9ca12473fbb1d023794ffd180000023c-1470245005.707928-777100845', 'MAIL': '/var/mail/cltbld', 'SHLVL': '1', 'TMOUT': '86400', 'NODE_PATH': '/usr/lib/nodejs:/usr/lib/node_modules:/usr/share/javascript', 'PWD': '/builds/slave/test', 'LOGNAME': 'cltbld', 'USER': 'cltbld', 'PROPERTIES_FILE': '/builds/slave/test/buildprops.json', 'PATH': '/usr/local/bin:/usr/local/bin:/usr/bin:/bin:/usr/local/games:/usr/games', 'HOME': '/home/cltbld', 'DISPLAY': ':0', '_': '/tools/buildbot/bin/python'}}, attempt #1 10:29:35 INFO - Running command: ['/builds/slave/test/build/venv/bin/pip', 'install', '--timeout', '120', '--no-index', '--find-links', 'http://pypi.pvt.build.mozilla.org.proxxy1.srv.releng.use1.mozilla.com/pub', '--find-links', 'http://pypi.pub.build.mozilla.org.proxxy1.srv.releng.use1.mozilla.com/pub', '--find-links', 'http://pypi.pvt.build.mozilla.org/pub', '--find-links', 'http://pypi.pub.build.mozilla.org/pub', 'psutil==3.1.1'] in /builds/slave/test/build 10:29:35 INFO - Copy/paste: /builds/slave/test/build/venv/bin/pip install --timeout 120 --no-index --find-links http://pypi.pvt.build.mozilla.org.proxxy1.srv.releng.use1.mozilla.com/pub --find-links http://pypi.pub.build.mozilla.org.proxxy1.srv.releng.use1.mozilla.com/pub --find-links http://pypi.pvt.build.mozilla.org/pub --find-links http://pypi.pub.build.mozilla.org/pub psutil==3.1.1 10:29:35 INFO - Using env: {'DISPLAY': ':0', 10:29:35 INFO - 'HOME': '/home/cltbld', 10:29:35 INFO - 'LANG': 'en_US.UTF-8', 10:29:35 INFO - 'LOGNAME': 'cltbld', 10:29:35 INFO - 'MAIL': '/var/mail/cltbld', 10:29:35 INFO - 'NODE_PATH': '/usr/lib/nodejs:/usr/lib/node_modules:/usr/share/javascript', 10:29:35 INFO - 'PATH': '/usr/local/bin:/usr/local/bin:/usr/bin:/bin:/usr/local/games:/usr/games', 10:29:35 INFO - 'PROPERTIES_FILE': '/builds/slave/test/buildprops.json', 10:29:35 INFO - 'PWD': '/builds/slave/test', 10:29:35 INFO - 'SHELL': '/bin/bash', 10:29:35 INFO - 'SHLVL': '1', 10:29:35 INFO - 'TERM': 'linux', 10:29:35 INFO - 'TMOUT': '86400', 10:29:35 INFO - 'USER': 'cltbld', 10:29:35 INFO - 'XDG_SESSION_COOKIE': '9ca12473fbb1d023794ffd180000023c-1470245005.707928-777100845', 10:29:35 INFO - '_': '/tools/buildbot/bin/python'} 10:29:36 INFO - Ignoring indexes: https://pypi.python.org/simple/ 10:29:36 INFO - Requirement already satisfied (use --upgrade to upgrade): psutil==3.1.1 in ./venv/lib/python2.7/site-packages 10:29:36 INFO - Cleaning up... 10:29:36 INFO - Return code: 0 10:29:36 INFO - Installing mock into virtualenv /builds/slave/test/build/venv 10:29:36 INFO - proxxy config: {'regions': ['.use1.', '.usw2.', '.scl3'], 'instances': ['proxxy1.srv.releng.use1.mozilla.com', 'proxxy1.srv.releng.usw2.mozilla.com', 'proxxy1.srv.releng.scl3.mozilla.com'], 'urls': [('http://ftp.mozilla.org', 'ftp.mozilla.org'), ('https://ftp.mozilla.org', 'ftp.mozilla.org'), ('https://ftp-ssl.mozilla.org', 'ftp.mozilla.org'), ('http://pvtbuilds.pvt.build.mozilla.org', 'pvtbuilds.mozilla.org'), ('http://pypi.pvt.build.mozilla.org', 'pypi.pvt.build.mozilla.org'), ('http://pypi.pub.build.mozilla.org', 'pypi.pub.build.mozilla.org'), ('https://queue.taskcluster.net', 'queue.taskcluster.net')]} 10:29:36 INFO - http://pypi.pvt.build.mozilla.org/pub matches http://pypi.pvt.build.mozilla.org 10:29:36 INFO - URL Candidate: http://pypi.pvt.build.mozilla.org.proxxy1.srv.releng.use1.mozilla.com/pub 10:29:36 INFO - proxxy config: {'regions': ['.use1.', '.usw2.', '.scl3'], 'instances': ['proxxy1.srv.releng.use1.mozilla.com', 'proxxy1.srv.releng.usw2.mozilla.com', 'proxxy1.srv.releng.scl3.mozilla.com'], 'urls': [('http://ftp.mozilla.org', 'ftp.mozilla.org'), ('https://ftp.mozilla.org', 'ftp.mozilla.org'), ('https://ftp-ssl.mozilla.org', 'ftp.mozilla.org'), ('http://pvtbuilds.pvt.build.mozilla.org', 'pvtbuilds.mozilla.org'), ('http://pypi.pvt.build.mozilla.org', 'pypi.pvt.build.mozilla.org'), ('http://pypi.pub.build.mozilla.org', 'pypi.pub.build.mozilla.org'), ('https://queue.taskcluster.net', 'queue.taskcluster.net')]} 10:29:36 INFO - http://pypi.pub.build.mozilla.org/pub matches http://pypi.pub.build.mozilla.org 10:29:36 INFO - URL Candidate: http://pypi.pub.build.mozilla.org.proxxy1.srv.releng.use1.mozilla.com/pub 10:29:36 INFO - retry: Calling run_command with args: [['/builds/slave/test/build/venv/bin/pip', 'install', '--timeout', '120', '--no-index', '--find-links', 'http://pypi.pvt.build.mozilla.org.proxxy1.srv.releng.use1.mozilla.com/pub', '--find-links', 'http://pypi.pub.build.mozilla.org.proxxy1.srv.releng.use1.mozilla.com/pub', '--find-links', 'http://pypi.pvt.build.mozilla.org/pub', '--find-links', 'http://pypi.pub.build.mozilla.org/pub', 'mock']], kwargs: {'error_level': 'warning', 'error_list': [{'substr': 'not found or a compiler error:', 'level': 'warning'}, {'regex': <_sre.SRE_Pattern object at 0x21a01f0>, 'level': 'error'}, {'regex': <_sre.SRE_Pattern object at 0x7fbbdf36de40>, 'level': 'warning'}, {'regex': <_sre.SRE_Pattern object at 0x22c3df0>, 'level': 'debug'}, {'substr': 'command not found', 'level': 'error'}, {'regex': <_sre.SRE_Pattern object at 0x22bff90>, 'level': 'warning'}, {'substr': 'Traceback (most recent call last)', 'level': 'error'}, {'substr': 'SyntaxError: ', 'level': 'error'}, {'substr': 'TypeError: ', 'level': 'error'}, {'substr': 'NameError: ', 'level': 'error'}, {'substr': 'ZeroDivisionError: ', 'level': 'error'}, {'regex': <_sre.SRE_Pattern object at 0x22c18f0>, 'level': 'critical'}, {'regex': <_sre.SRE_Pattern object at 0x22c1b70>, 'level': 'critical'}], 'cwd': '/builds/slave/test/build', 'env': {'LANG': 'en_US.UTF-8', 'TERM': 'linux', 'SHELL': '/bin/bash', 'XDG_SESSION_COOKIE': '9ca12473fbb1d023794ffd180000023c-1470245005.707928-777100845', 'MAIL': '/var/mail/cltbld', 'SHLVL': '1', 'TMOUT': '86400', 'NODE_PATH': '/usr/lib/nodejs:/usr/lib/node_modules:/usr/share/javascript', 'PWD': '/builds/slave/test', 'LOGNAME': 'cltbld', 'USER': 'cltbld', 'PROPERTIES_FILE': '/builds/slave/test/buildprops.json', 'PATH': '/usr/local/bin:/usr/local/bin:/usr/bin:/bin:/usr/local/games:/usr/games', 'HOME': '/home/cltbld', 'DISPLAY': ':0', '_': '/tools/buildbot/bin/python'}}, attempt #1 10:29:36 INFO - Running command: ['/builds/slave/test/build/venv/bin/pip', 'install', '--timeout', '120', '--no-index', '--find-links', 'http://pypi.pvt.build.mozilla.org.proxxy1.srv.releng.use1.mozilla.com/pub', '--find-links', 'http://pypi.pub.build.mozilla.org.proxxy1.srv.releng.use1.mozilla.com/pub', '--find-links', 'http://pypi.pvt.build.mozilla.org/pub', '--find-links', 'http://pypi.pub.build.mozilla.org/pub', 'mock'] in /builds/slave/test/build 10:29:36 INFO - Copy/paste: /builds/slave/test/build/venv/bin/pip install --timeout 120 --no-index --find-links http://pypi.pvt.build.mozilla.org.proxxy1.srv.releng.use1.mozilla.com/pub --find-links http://pypi.pub.build.mozilla.org.proxxy1.srv.releng.use1.mozilla.com/pub --find-links http://pypi.pvt.build.mozilla.org/pub --find-links http://pypi.pub.build.mozilla.org/pub mock 10:29:36 INFO - Using env: {'DISPLAY': ':0', 10:29:36 INFO - 'HOME': '/home/cltbld', 10:29:36 INFO - 'LANG': 'en_US.UTF-8', 10:29:36 INFO - 'LOGNAME': 'cltbld', 10:29:36 INFO - 'MAIL': '/var/mail/cltbld', 10:29:36 INFO - 'NODE_PATH': '/usr/lib/nodejs:/usr/lib/node_modules:/usr/share/javascript', 10:29:36 INFO - 'PATH': '/usr/local/bin:/usr/local/bin:/usr/bin:/bin:/usr/local/games:/usr/games', 10:29:36 INFO - 'PROPERTIES_FILE': '/builds/slave/test/buildprops.json', 10:29:36 INFO - 'PWD': '/builds/slave/test', 10:29:36 INFO - 'SHELL': '/bin/bash', 10:29:36 INFO - 'SHLVL': '1', 10:29:36 INFO - 'TERM': 'linux', 10:29:36 INFO - 'TMOUT': '86400', 10:29:36 INFO - 'USER': 'cltbld', 10:29:36 INFO - 'XDG_SESSION_COOKIE': '9ca12473fbb1d023794ffd180000023c-1470245005.707928-777100845', 10:29:36 INFO - '_': '/tools/buildbot/bin/python'} 10:29:36 INFO - Ignoring indexes: https://pypi.python.org/simple/ 10:29:36 INFO - Downloading/unpacking mock 10:29:36 INFO - http://pypi.pvt.build.mozilla.org/pub uses an insecure transport scheme (http). Consider using https if pypi.pvt.build.mozilla.org has it available 10:29:36 INFO - http://pypi.pub.build.mozilla.org/pub uses an insecure transport scheme (http). Consider using https if pypi.pub.build.mozilla.org has it available 10:29:36 INFO - http://pypi.pvt.build.mozilla.org.proxxy1.srv.releng.use1.mozilla.com/pub uses an insecure transport scheme (http). Consider using https if pypi.pvt.build.mozilla.org.proxxy1.srv.releng.use1.mozilla.com has it available 10:29:36 INFO - http://pypi.pub.build.mozilla.org.proxxy1.srv.releng.use1.mozilla.com/pub uses an insecure transport scheme (http). Consider using https if pypi.pub.build.mozilla.org.proxxy1.srv.releng.use1.mozilla.com has it available 10:29:36 INFO - http://pypi.pvt.build.mozilla.org/pub uses an insecure transport scheme (http). Consider using https if pypi.pvt.build.mozilla.org has it available 10:29:36 INFO - http://pypi.pub.build.mozilla.org/pub uses an insecure transport scheme (http). Consider using https if pypi.pub.build.mozilla.org has it available 10:29:42 INFO - Running setup.py (path:/builds/slave/test/build/venv/build/mock/setup.py) egg_info for package mock 10:29:42 INFO - warning: no files found matching '*.png' under directory 'docs' 10:29:42 INFO - warning: no files found matching '*.css' under directory 'docs' 10:29:42 INFO - warning: no files found matching '*.html' under directory 'docs' 10:29:42 INFO - warning: no files found matching '*.js' under directory 'docs' 10:29:42 INFO - Installing collected packages: mock 10:29:42 INFO - Running setup.py install for mock 10:29:42 INFO - warning: no files found matching '*.png' under directory 'docs' 10:29:42 INFO - warning: no files found matching '*.css' under directory 'docs' 10:29:42 INFO - warning: no files found matching '*.html' under directory 'docs' 10:29:42 INFO - warning: no files found matching '*.js' under directory 'docs' 10:29:42 INFO - Successfully installed mock 10:29:42 INFO - Cleaning up... 10:29:42 INFO - Return code: 0 10:29:42 INFO - Installing simplejson into virtualenv /builds/slave/test/build/venv 10:29:42 INFO - proxxy config: {'regions': ['.use1.', '.usw2.', '.scl3'], 'instances': ['proxxy1.srv.releng.use1.mozilla.com', 'proxxy1.srv.releng.usw2.mozilla.com', 'proxxy1.srv.releng.scl3.mozilla.com'], 'urls': [('http://ftp.mozilla.org', 'ftp.mozilla.org'), ('https://ftp.mozilla.org', 'ftp.mozilla.org'), ('https://ftp-ssl.mozilla.org', 'ftp.mozilla.org'), ('http://pvtbuilds.pvt.build.mozilla.org', 'pvtbuilds.mozilla.org'), ('http://pypi.pvt.build.mozilla.org', 'pypi.pvt.build.mozilla.org'), ('http://pypi.pub.build.mozilla.org', 'pypi.pub.build.mozilla.org'), ('https://queue.taskcluster.net', 'queue.taskcluster.net')]} 10:29:42 INFO - http://pypi.pvt.build.mozilla.org/pub matches http://pypi.pvt.build.mozilla.org 10:29:42 INFO - URL Candidate: http://pypi.pvt.build.mozilla.org.proxxy1.srv.releng.use1.mozilla.com/pub 10:29:42 INFO - proxxy config: {'regions': ['.use1.', '.usw2.', '.scl3'], 'instances': ['proxxy1.srv.releng.use1.mozilla.com', 'proxxy1.srv.releng.usw2.mozilla.com', 'proxxy1.srv.releng.scl3.mozilla.com'], 'urls': [('http://ftp.mozilla.org', 'ftp.mozilla.org'), ('https://ftp.mozilla.org', 'ftp.mozilla.org'), ('https://ftp-ssl.mozilla.org', 'ftp.mozilla.org'), ('http://pvtbuilds.pvt.build.mozilla.org', 'pvtbuilds.mozilla.org'), ('http://pypi.pvt.build.mozilla.org', 'pypi.pvt.build.mozilla.org'), ('http://pypi.pub.build.mozilla.org', 'pypi.pub.build.mozilla.org'), ('https://queue.taskcluster.net', 'queue.taskcluster.net')]} 10:29:42 INFO - http://pypi.pub.build.mozilla.org/pub matches http://pypi.pub.build.mozilla.org 10:29:42 INFO - URL Candidate: http://pypi.pub.build.mozilla.org.proxxy1.srv.releng.use1.mozilla.com/pub 10:29:42 INFO - retry: Calling run_command with args: [['/builds/slave/test/build/venv/bin/pip', 'install', '--timeout', '120', '--no-index', '--find-links', 'http://pypi.pvt.build.mozilla.org.proxxy1.srv.releng.use1.mozilla.com/pub', '--find-links', 'http://pypi.pub.build.mozilla.org.proxxy1.srv.releng.use1.mozilla.com/pub', '--find-links', 'http://pypi.pvt.build.mozilla.org/pub', '--find-links', 'http://pypi.pub.build.mozilla.org/pub', 'simplejson']], kwargs: {'error_level': 'warning', 'error_list': [{'substr': 'not found or a compiler error:', 'level': 'warning'}, {'regex': <_sre.SRE_Pattern object at 0x21a01f0>, 'level': 'error'}, {'regex': <_sre.SRE_Pattern object at 0x7fbbdf36de40>, 'level': 'warning'}, {'regex': <_sre.SRE_Pattern object at 0x22c3df0>, 'level': 'debug'}, {'substr': 'command not found', 'level': 'error'}, {'regex': <_sre.SRE_Pattern object at 0x22bff90>, 'level': 'warning'}, {'substr': 'Traceback (most recent call last)', 'level': 'error'}, {'substr': 'SyntaxError: ', 'level': 'error'}, {'substr': 'TypeError: ', 'level': 'error'}, {'substr': 'NameError: ', 'level': 'error'}, {'substr': 'ZeroDivisionError: ', 'level': 'error'}, {'regex': <_sre.SRE_Pattern object at 0x22c18f0>, 'level': 'critical'}, {'regex': <_sre.SRE_Pattern object at 0x22c1b70>, 'level': 'critical'}], 'cwd': '/builds/slave/test/build', 'env': {'LANG': 'en_US.UTF-8', 'TERM': 'linux', 'SHELL': '/bin/bash', 'XDG_SESSION_COOKIE': '9ca12473fbb1d023794ffd180000023c-1470245005.707928-777100845', 'MAIL': '/var/mail/cltbld', 'SHLVL': '1', 'TMOUT': '86400', 'NODE_PATH': '/usr/lib/nodejs:/usr/lib/node_modules:/usr/share/javascript', 'PWD': '/builds/slave/test', 'LOGNAME': 'cltbld', 'USER': 'cltbld', 'PROPERTIES_FILE': '/builds/slave/test/buildprops.json', 'PATH': '/usr/local/bin:/usr/local/bin:/usr/bin:/bin:/usr/local/games:/usr/games', 'HOME': '/home/cltbld', 'DISPLAY': ':0', '_': '/tools/buildbot/bin/python'}}, attempt #1 10:29:42 INFO - Running command: ['/builds/slave/test/build/venv/bin/pip', 'install', '--timeout', '120', '--no-index', '--find-links', 'http://pypi.pvt.build.mozilla.org.proxxy1.srv.releng.use1.mozilla.com/pub', '--find-links', 'http://pypi.pub.build.mozilla.org.proxxy1.srv.releng.use1.mozilla.com/pub', '--find-links', 'http://pypi.pvt.build.mozilla.org/pub', '--find-links', 'http://pypi.pub.build.mozilla.org/pub', 'simplejson'] in /builds/slave/test/build 10:29:42 INFO - Copy/paste: /builds/slave/test/build/venv/bin/pip install --timeout 120 --no-index --find-links http://pypi.pvt.build.mozilla.org.proxxy1.srv.releng.use1.mozilla.com/pub --find-links http://pypi.pub.build.mozilla.org.proxxy1.srv.releng.use1.mozilla.com/pub --find-links http://pypi.pvt.build.mozilla.org/pub --find-links http://pypi.pub.build.mozilla.org/pub simplejson 10:29:42 INFO - Using env: {'DISPLAY': ':0', 10:29:42 INFO - 'HOME': '/home/cltbld', 10:29:42 INFO - 'LANG': 'en_US.UTF-8', 10:29:42 INFO - 'LOGNAME': 'cltbld', 10:29:42 INFO - 'MAIL': '/var/mail/cltbld', 10:29:42 INFO - 'NODE_PATH': '/usr/lib/nodejs:/usr/lib/node_modules:/usr/share/javascript', 10:29:42 INFO - 'PATH': '/usr/local/bin:/usr/local/bin:/usr/bin:/bin:/usr/local/games:/usr/games', 10:29:42 INFO - 'PROPERTIES_FILE': '/builds/slave/test/buildprops.json', 10:29:42 INFO - 'PWD': '/builds/slave/test', 10:29:42 INFO - 'SHELL': '/bin/bash', 10:29:42 INFO - 'SHLVL': '1', 10:29:42 INFO - 'TERM': 'linux', 10:29:42 INFO - 'TMOUT': '86400', 10:29:42 INFO - 'USER': 'cltbld', 10:29:42 INFO - 'XDG_SESSION_COOKIE': '9ca12473fbb1d023794ffd180000023c-1470245005.707928-777100845', 10:29:42 INFO - '_': '/tools/buildbot/bin/python'} 10:29:43 INFO - Ignoring indexes: https://pypi.python.org/simple/ 10:29:43 INFO - Downloading/unpacking simplejson 10:29:43 INFO - http://pypi.pvt.build.mozilla.org/pub uses an insecure transport scheme (http). Consider using https if pypi.pvt.build.mozilla.org has it available 10:29:43 INFO - http://pypi.pub.build.mozilla.org/pub uses an insecure transport scheme (http). Consider using https if pypi.pub.build.mozilla.org has it available 10:29:43 INFO - http://pypi.pvt.build.mozilla.org.proxxy1.srv.releng.use1.mozilla.com/pub uses an insecure transport scheme (http). Consider using https if pypi.pvt.build.mozilla.org.proxxy1.srv.releng.use1.mozilla.com has it available 10:29:43 INFO - http://pypi.pub.build.mozilla.org.proxxy1.srv.releng.use1.mozilla.com/pub uses an insecure transport scheme (http). Consider using https if pypi.pub.build.mozilla.org.proxxy1.srv.releng.use1.mozilla.com has it available 10:29:43 INFO - http://pypi.pvt.build.mozilla.org/pub uses an insecure transport scheme (http). Consider using https if pypi.pvt.build.mozilla.org has it available 10:29:43 INFO - http://pypi.pub.build.mozilla.org/pub uses an insecure transport scheme (http). Consider using https if pypi.pub.build.mozilla.org has it available 10:29:46 INFO - Cleaning up... 10:29:46 INFO - Exception: 10:29:46 ERROR - Traceback (most recent call last): 10:29:46 INFO - File "/builds/slave/test/build/venv/local/lib/python2.7/site-packages/pip-1.5.5-py2.7.egg/pip/basecommand.py", line 122, in main 10:29:46 INFO - status = self.run(options, args) 10:29:46 INFO - File "/builds/slave/test/build/venv/local/lib/python2.7/site-packages/pip-1.5.5-py2.7.egg/pip/commands/install.py", line 278, in run 10:29:46 INFO - requirement_set.prepare_files(finder, force_root_egg_info=self.bundle, bundle=self.bundle) 10:29:46 INFO - File "/builds/slave/test/build/venv/local/lib/python2.7/site-packages/pip-1.5.5-py2.7.egg/pip/req.py", line 1177, in prepare_files 10:29:46 INFO - url = finder.find_requirement(req_to_install, upgrade=self.upgrade) 10:29:46 INFO - File "/builds/slave/test/build/venv/local/lib/python2.7/site-packages/pip-1.5.5-py2.7.egg/pip/index.py", line 252, in find_requirement 10:29:46 INFO - for page in self._get_pages(locations, req): 10:29:46 INFO - File "/builds/slave/test/build/venv/local/lib/python2.7/site-packages/pip-1.5.5-py2.7.egg/pip/index.py", line 387, in _get_pages 10:29:46 INFO - page = self._get_page(location, req) 10:29:46 INFO - File "/builds/slave/test/build/venv/local/lib/python2.7/site-packages/pip-1.5.5-py2.7.egg/pip/index.py", line 568, in _get_page 10:29:46 INFO - session=self.session, 10:29:46 INFO - File "/builds/slave/test/build/venv/local/lib/python2.7/site-packages/pip-1.5.5-py2.7.egg/pip/index.py", line 670, in get_page 10:29:46 INFO - resp = session.get(url, headers={"Accept": "text/html"}) 10:29:46 INFO - File "/builds/slave/test/build/venv/local/lib/python2.7/site-packages/pip-1.5.5-py2.7.egg/pip/_vendor/requests/sessions.py", line 395, in get 10:29:46 INFO - return self.request('GET', url, **kwargs) 10:29:46 INFO - File "/builds/slave/test/build/venv/local/lib/python2.7/site-packages/pip-1.5.5-py2.7.egg/pip/download.py", line 237, in request 10:29:46 INFO - return super(PipSession, self).request(method, url, *args, **kwargs) 10:29:46 INFO - File "/builds/slave/test/build/venv/local/lib/python2.7/site-packages/pip-1.5.5-py2.7.egg/pip/_vendor/requests/sessions.py", line 383, in request 10:29:46 INFO - resp = self.send(prep, **send_kwargs) 10:29:46 INFO - File "/builds/slave/test/build/venv/local/lib/python2.7/site-packages/pip-1.5.5-py2.7.egg/pip/_vendor/requests/sessions.py", line 506, in send 10:29:46 INFO - history = [resp for resp in gen] if allow_redirects else [] 10:29:46 INFO - File "/builds/slave/test/build/venv/local/lib/python2.7/site-packages/pip-1.5.5-py2.7.egg/pip/_vendor/requests/sessions.py", line 168, in resolve_redirects 10:29:46 INFO - allow_redirects=False, 10:29:46 INFO - File "/builds/slave/test/build/venv/local/lib/python2.7/site-packages/pip-1.5.5-py2.7.egg/pip/_vendor/requests/sessions.py", line 486, in send 10:29:46 INFO - r = adapter.send(request, **kwargs) 10:29:46 INFO - File "/builds/slave/test/build/venv/local/lib/python2.7/site-packages/pip-1.5.5-py2.7.egg/pip/_vendor/requests/adapters.py", line 394, in send 10:29:46 INFO - r.content 10:29:46 INFO - File "/builds/slave/test/build/venv/local/lib/python2.7/site-packages/pip-1.5.5-py2.7.egg/pip/_vendor/requests/models.py", line 679, in content 10:29:46 INFO - self._content = bytes().join(self.iter_content(CONTENT_CHUNK_SIZE)) or bytes() 10:29:46 INFO - File "/builds/slave/test/build/venv/local/lib/python2.7/site-packages/pip-1.5.5-py2.7.egg/pip/_vendor/requests/models.py", line 616, in generate 10:29:46 INFO - decode_content=True): 10:29:46 INFO - File "/builds/slave/test/build/venv/local/lib/python2.7/site-packages/pip-1.5.5-py2.7.egg/pip/_vendor/requests/packages/urllib3/response.py", line 236, in stream 10:29:46 INFO - data = self.read(amt=amt, decode_content=decode_content) 10:29:46 INFO - File "/builds/slave/test/build/venv/local/lib/python2.7/site-packages/pip-1.5.5-py2.7.egg/pip/_vendor/requests/packages/urllib3/response.py", line 183, in read 10:29:46 INFO - data = self._fp.read(amt) 10:29:46 INFO - File "/usr/lib/python2.7/httplib.py", line 541, in read 10:29:46 INFO - return self._read_chunked(amt) 10:29:46 INFO - File "/usr/lib/python2.7/httplib.py", line 601, in _read_chunked 10:29:46 INFO - value.append(self._safe_read(chunk_left)) 10:29:46 INFO - File "/usr/lib/python2.7/httplib.py", line 647, in _safe_read 10:29:46 INFO - chunk = self.fp.read(min(amt, MAXAMOUNT)) 10:29:46 INFO - File "/usr/lib/python2.7/socket.py", line 380, in read 10:29:46 INFO - data = self._sock.recv(left) 10:29:46 INFO - error: [Errno 104] Connection reset by peer 10:29:46 INFO - Storing debug log for failure in /home/cltbld/.pip/pip.log 10:29:46 WARNING - Return code: 2 10:29:46 INFO - retry: Failed, sleeping 60 seconds before retrying 10:30:46 INFO - retry: Calling run_command with args: [['/builds/slave/test/build/venv/bin/pip', 'install', '--timeout', '120', '--no-index', '--find-links', 'http://pypi.pvt.build.mozilla.org.proxxy1.srv.releng.use1.mozilla.com/pub', '--find-links', 'http://pypi.pub.build.mozilla.org.proxxy1.srv.releng.use1.mozilla.com/pub', '--find-links', 'http://pypi.pvt.build.mozilla.org/pub', '--find-links', 'http://pypi.pub.build.mozilla.org/pub', 'simplejson']], kwargs: {'error_level': 'warning', 'error_list': [{'substr': 'not found or a compiler error:', 'level': 'warning'}, {'regex': <_sre.SRE_Pattern object at 0x21a01f0>, 'level': 'error'}, {'regex': <_sre.SRE_Pattern object at 0x7fbbdf36de40>, 'level': 'warning'}, {'regex': <_sre.SRE_Pattern object at 0x22c3df0>, 'level': 'debug'}, {'substr': 'command not found', 'level': 'error'}, {'regex': <_sre.SRE_Pattern object at 0x22bff90>, 'level': 'warning'}, {'substr': 'Traceback (most recent call last)', 'level': 'error'}, {'substr': 'SyntaxError: ', 'level': 'error'}, {'substr': 'TypeError: ', 'level': 'error'}, {'substr': 'NameError: ', 'level': 'error'}, {'substr': 'ZeroDivisionError: ', 'level': 'error'}, {'regex': <_sre.SRE_Pattern object at 0x22c18f0>, 'level': 'critical'}, {'regex': <_sre.SRE_Pattern object at 0x22c1b70>, 'level': 'critical'}], 'cwd': '/builds/slave/test/build', 'env': {'LANG': 'en_US.UTF-8', 'TERM': 'linux', 'SHELL': '/bin/bash', 'XDG_SESSION_COOKIE': '9ca12473fbb1d023794ffd180000023c-1470245005.707928-777100845', 'MAIL': '/var/mail/cltbld', 'SHLVL': '1', 'TMOUT': '86400', 'NODE_PATH': '/usr/lib/nodejs:/usr/lib/node_modules:/usr/share/javascript', 'PWD': '/builds/slave/test', 'LOGNAME': 'cltbld', 'USER': 'cltbld', 'PROPERTIES_FILE': '/builds/slave/test/buildprops.json', 'PATH': '/usr/local/bin:/usr/local/bin:/usr/bin:/bin:/usr/local/games:/usr/games', 'HOME': '/home/cltbld', 'DISPLAY': ':0', '_': '/tools/buildbot/bin/python'}}, attempt #2 10:30:46 INFO - Running command: ['/builds/slave/test/build/venv/bin/pip', 'install', '--timeout', '120', '--no-index', '--find-links', 'http://pypi.pvt.build.mozilla.org.proxxy1.srv.releng.use1.mozilla.com/pub', '--find-links', 'http://pypi.pub.build.mozilla.org.proxxy1.srv.releng.use1.mozilla.com/pub', '--find-links', 'http://pypi.pvt.build.mozilla.org/pub', '--find-links', 'http://pypi.pub.build.mozilla.org/pub', 'simplejson'] in /builds/slave/test/build 10:30:46 INFO - Copy/paste: /builds/slave/test/build/venv/bin/pip install --timeout 120 --no-index --find-links http://pypi.pvt.build.mozilla.org.proxxy1.srv.releng.use1.mozilla.com/pub --find-links http://pypi.pub.build.mozilla.org.proxxy1.srv.releng.use1.mozilla.com/pub --find-links http://pypi.pvt.build.mozilla.org/pub --find-links http://pypi.pub.build.mozilla.org/pub simplejson 10:30:46 INFO - Using env: {'DISPLAY': ':0', 10:30:46 INFO - 'HOME': '/home/cltbld', 10:30:46 INFO - 'LANG': 'en_US.UTF-8', 10:30:46 INFO - 'LOGNAME': 'cltbld', 10:30:46 INFO - 'MAIL': '/var/mail/cltbld', 10:30:46 INFO - 'NODE_PATH': '/usr/lib/nodejs:/usr/lib/node_modules:/usr/share/javascript', 10:30:46 INFO - 'PATH': '/usr/local/bin:/usr/local/bin:/usr/bin:/bin:/usr/local/games:/usr/games', 10:30:46 INFO - 'PROPERTIES_FILE': '/builds/slave/test/buildprops.json', 10:30:46 INFO - 'PWD': '/builds/slave/test', 10:30:46 INFO - 'SHELL': '/bin/bash', 10:30:46 INFO - 'SHLVL': '1', 10:30:46 INFO - 'TERM': 'linux', 10:30:46 INFO - 'TMOUT': '86400', 10:30:46 INFO - 'USER': 'cltbld', 10:30:46 INFO - 'XDG_SESSION_COOKIE': '9ca12473fbb1d023794ffd180000023c-1470245005.707928-777100845', 10:30:46 INFO - '_': '/tools/buildbot/bin/python'} 10:30:46 INFO - Ignoring indexes: https://pypi.python.org/simple/ 10:30:46 INFO - Downloading/unpacking simplejson 10:30:46 INFO - http://pypi.pvt.build.mozilla.org/pub uses an insecure transport scheme (http). Consider using https if pypi.pvt.build.mozilla.org has it available 10:30:46 INFO - http://pypi.pub.build.mozilla.org/pub uses an insecure transport scheme (http). Consider using https if pypi.pub.build.mozilla.org has it available 10:30:46 INFO - http://pypi.pvt.build.mozilla.org.proxxy1.srv.releng.use1.mozilla.com/pub uses an insecure transport scheme (http). Consider using https if pypi.pvt.build.mozilla.org.proxxy1.srv.releng.use1.mozilla.com has it available 10:30:46 INFO - http://pypi.pub.build.mozilla.org.proxxy1.srv.releng.use1.mozilla.com/pub uses an insecure transport scheme (http). Consider using https if pypi.pub.build.mozilla.org.proxxy1.srv.releng.use1.mozilla.com has it available 10:30:46 INFO - http://pypi.pvt.build.mozilla.org/pub uses an insecure transport scheme (http). Consider using https if pypi.pvt.build.mozilla.org has it available 10:30:46 INFO - http://pypi.pub.build.mozilla.org/pub uses an insecure transport scheme (http). Consider using https if pypi.pub.build.mozilla.org has it available 10:30:51 INFO - Running setup.py (path:/builds/slave/test/build/venv/build/simplejson/setup.py) egg_info for package simplejson 10:30:51 INFO - Installing collected packages: simplejson 10:30:51 INFO - Running setup.py install for simplejson 10:30:51 INFO - building 'simplejson._speedups' extension 10:30:51 INFO - gcc -pthread -fno-strict-aliasing -DNDEBUG -g -fwrapv -O2 -Wall -Wstrict-prototypes -fPIC -I/usr/include/python2.7 -c simplejson/_speedups.c -o build/temp.linux-x86_64-2.7/simplejson/_speedups.o 10:30:53 INFO - gcc -pthread -shared -Wl,-O1 -Wl,-Bsymbolic-functions -Wl,-Bsymbolic-functions -Wl,-z,relro build/temp.linux-x86_64-2.7/simplejson/_speedups.o -o build/lib.linux-x86_64-2.7/simplejson/_speedups.so 10:30:53 INFO - Successfully installed simplejson 10:30:53 INFO - Cleaning up... 10:30:53 INFO - Return code: 0 10:30:53 INFO - Installing None into virtualenv /builds/slave/test/build/venv 10:30:53 INFO - proxxy config: {'regions': ['.use1.', '.usw2.', '.scl3'], 'instances': ['proxxy1.srv.releng.use1.mozilla.com', 'proxxy1.srv.releng.usw2.mozilla.com', 'proxxy1.srv.releng.scl3.mozilla.com'], 'urls': [('http://ftp.mozilla.org', 'ftp.mozilla.org'), ('https://ftp.mozilla.org', 'ftp.mozilla.org'), ('https://ftp-ssl.mozilla.org', 'ftp.mozilla.org'), ('http://pvtbuilds.pvt.build.mozilla.org', 'pvtbuilds.mozilla.org'), ('http://pypi.pvt.build.mozilla.org', 'pypi.pvt.build.mozilla.org'), ('http://pypi.pub.build.mozilla.org', 'pypi.pub.build.mozilla.org'), ('https://queue.taskcluster.net', 'queue.taskcluster.net')]} 10:30:53 INFO - http://pypi.pvt.build.mozilla.org/pub matches http://pypi.pvt.build.mozilla.org 10:30:53 INFO - URL Candidate: http://pypi.pvt.build.mozilla.org.proxxy1.srv.releng.use1.mozilla.com/pub 10:30:53 INFO - proxxy config: {'regions': ['.use1.', '.usw2.', '.scl3'], 'instances': ['proxxy1.srv.releng.use1.mozilla.com', 'proxxy1.srv.releng.usw2.mozilla.com', 'proxxy1.srv.releng.scl3.mozilla.com'], 'urls': [('http://ftp.mozilla.org', 'ftp.mozilla.org'), ('https://ftp.mozilla.org', 'ftp.mozilla.org'), ('https://ftp-ssl.mozilla.org', 'ftp.mozilla.org'), ('http://pvtbuilds.pvt.build.mozilla.org', 'pvtbuilds.mozilla.org'), ('http://pypi.pvt.build.mozilla.org', 'pypi.pvt.build.mozilla.org'), ('http://pypi.pub.build.mozilla.org', 'pypi.pub.build.mozilla.org'), ('https://queue.taskcluster.net', 'queue.taskcluster.net')]} 10:30:53 INFO - http://pypi.pub.build.mozilla.org/pub matches http://pypi.pub.build.mozilla.org 10:30:53 INFO - URL Candidate: http://pypi.pub.build.mozilla.org.proxxy1.srv.releng.use1.mozilla.com/pub 10:30:53 INFO - retry: Calling run_command with args: [['/builds/slave/test/build/venv/bin/pip', 'install', '--no-deps', '--timeout', '120', '-r', '/builds/slave/test/build/tests/config/marionette_requirements.txt', '--no-index', '--find-links', 'http://pypi.pvt.build.mozilla.org.proxxy1.srv.releng.use1.mozilla.com/pub', '--find-links', 'http://pypi.pub.build.mozilla.org.proxxy1.srv.releng.use1.mozilla.com/pub', '--find-links', 'http://pypi.pvt.build.mozilla.org/pub', '--find-links', 'http://pypi.pub.build.mozilla.org/pub']], kwargs: {'error_level': 'warning', 'error_list': [{'substr': 'not found or a compiler error:', 'level': 'warning'}, {'regex': <_sre.SRE_Pattern object at 0x21a01f0>, 'level': 'error'}, {'regex': <_sre.SRE_Pattern object at 0x7fbbdf36de40>, 'level': 'warning'}, {'regex': <_sre.SRE_Pattern object at 0x22c3df0>, 'level': 'debug'}, {'substr': 'command not found', 'level': 'error'}, {'regex': <_sre.SRE_Pattern object at 0x22bff90>, 'level': 'warning'}, {'substr': 'Traceback (most recent call last)', 'level': 'error'}, {'substr': 'SyntaxError: ', 'level': 'error'}, {'substr': 'TypeError: ', 'level': 'error'}, {'substr': 'NameError: ', 'level': 'error'}, {'substr': 'ZeroDivisionError: ', 'level': 'error'}, {'regex': <_sre.SRE_Pattern object at 0x22c18f0>, 'level': 'critical'}, {'regex': <_sre.SRE_Pattern object at 0x22c1b70>, 'level': 'critical'}], 'cwd': '/builds/slave/test/build/tests/config', 'env': {'LANG': 'en_US.UTF-8', 'TERM': 'linux', 'SHELL': '/bin/bash', 'XDG_SESSION_COOKIE': '9ca12473fbb1d023794ffd180000023c-1470245005.707928-777100845', 'MAIL': '/var/mail/cltbld', 'SHLVL': '1', 'TMOUT': '86400', 'NODE_PATH': '/usr/lib/nodejs:/usr/lib/node_modules:/usr/share/javascript', 'PWD': '/builds/slave/test', 'LOGNAME': 'cltbld', 'USER': 'cltbld', 'PROPERTIES_FILE': '/builds/slave/test/buildprops.json', 'PATH': '/usr/local/bin:/usr/local/bin:/usr/bin:/bin:/usr/local/games:/usr/games', 'HOME': '/home/cltbld', 'DISPLAY': ':0', '_': '/tools/buildbot/bin/python'}}, attempt #1 10:30:53 INFO - Running command: ['/builds/slave/test/build/venv/bin/pip', 'install', '--no-deps', '--timeout', '120', '-r', '/builds/slave/test/build/tests/config/marionette_requirements.txt', '--no-index', '--find-links', 'http://pypi.pvt.build.mozilla.org.proxxy1.srv.releng.use1.mozilla.com/pub', '--find-links', 'http://pypi.pub.build.mozilla.org.proxxy1.srv.releng.use1.mozilla.com/pub', '--find-links', 'http://pypi.pvt.build.mozilla.org/pub', '--find-links', 'http://pypi.pub.build.mozilla.org/pub'] in /builds/slave/test/build/tests/config 10:30:53 INFO - Copy/paste: /builds/slave/test/build/venv/bin/pip install --no-deps --timeout 120 -r /builds/slave/test/build/tests/config/marionette_requirements.txt --no-index --find-links http://pypi.pvt.build.mozilla.org.proxxy1.srv.releng.use1.mozilla.com/pub --find-links http://pypi.pub.build.mozilla.org.proxxy1.srv.releng.use1.mozilla.com/pub --find-links http://pypi.pvt.build.mozilla.org/pub --find-links http://pypi.pub.build.mozilla.org/pub 10:30:53 INFO - Using env: {'DISPLAY': ':0', 10:30:53 INFO - 'HOME': '/home/cltbld', 10:30:53 INFO - 'LANG': 'en_US.UTF-8', 10:30:53 INFO - 'LOGNAME': 'cltbld', 10:30:53 INFO - 'MAIL': '/var/mail/cltbld', 10:30:53 INFO - 'NODE_PATH': '/usr/lib/nodejs:/usr/lib/node_modules:/usr/share/javascript', 10:30:53 INFO - 'PATH': '/usr/local/bin:/usr/local/bin:/usr/bin:/bin:/usr/local/games:/usr/games', 10:30:53 INFO - 'PROPERTIES_FILE': '/builds/slave/test/buildprops.json', 10:30:53 INFO - 'PWD': '/builds/slave/test', 10:30:53 INFO - 'SHELL': '/bin/bash', 10:30:53 INFO - 'SHLVL': '1', 10:30:53 INFO - 'TERM': 'linux', 10:30:53 INFO - 'TMOUT': '86400', 10:30:53 INFO - 'USER': 'cltbld', 10:30:53 INFO - 'XDG_SESSION_COOKIE': '9ca12473fbb1d023794ffd180000023c-1470245005.707928-777100845', 10:30:53 INFO - '_': '/tools/buildbot/bin/python'} 10:30:54 INFO - Ignoring indexes: https://pypi.python.org/simple/ 10:30:54 INFO - Unpacking /builds/slave/test/build/tests/mozbase/manifestparser 10:30:54 INFO - Running setup.py (path:/tmp/pip-oSOds4-build/setup.py) egg_info for package from file:///builds/slave/test/build/tests/mozbase/manifestparser 10:30:54 INFO - Requirement already satisfied (use --upgrade to upgrade): manifestparser==1.1 from file:///builds/slave/test/build/tests/mozbase/manifestparser in /builds/slave/test/build/venv/lib/python2.7/site-packages (from -r /builds/slave/test/build/tests/config/mozbase_requirements.txt (line 1)) 10:30:54 INFO - Unpacking /builds/slave/test/build/tests/mozbase/mozcrash 10:30:54 INFO - Running setup.py (path:/tmp/pip-80kbiR-build/setup.py) egg_info for package from file:///builds/slave/test/build/tests/mozbase/mozcrash 10:30:54 INFO - Requirement already satisfied (use --upgrade to upgrade): mozcrash==0.17 from file:///builds/slave/test/build/tests/mozbase/mozcrash in /builds/slave/test/build/venv/lib/python2.7/site-packages (from -r /builds/slave/test/build/tests/config/mozbase_requirements.txt (line 2)) 10:30:54 INFO - Unpacking /builds/slave/test/build/tests/mozbase/mozdebug 10:30:54 INFO - Running setup.py (path:/tmp/pip-jG9G1C-build/setup.py) egg_info for package from file:///builds/slave/test/build/tests/mozbase/mozdebug 10:30:54 INFO - Requirement already satisfied (use --upgrade to upgrade): mozdebug==0.1 from file:///builds/slave/test/build/tests/mozbase/mozdebug in /builds/slave/test/build/venv/lib/python2.7/site-packages (from -r /builds/slave/test/build/tests/config/mozbase_requirements.txt (line 3)) 10:30:54 INFO - Unpacking /builds/slave/test/build/tests/mozbase/mozdevice 10:30:54 INFO - Running setup.py (path:/tmp/pip-kykCWd-build/setup.py) egg_info for package from file:///builds/slave/test/build/tests/mozbase/mozdevice 10:30:54 INFO - Requirement already satisfied (use --upgrade to upgrade): mozdevice==0.48 from file:///builds/slave/test/build/tests/mozbase/mozdevice in /builds/slave/test/build/venv/lib/python2.7/site-packages (from -r /builds/slave/test/build/tests/config/mozbase_requirements.txt (line 4)) 10:30:54 INFO - Unpacking /builds/slave/test/build/tests/mozbase/mozfile 10:30:54 INFO - Running setup.py (path:/tmp/pip-ADQnFT-build/setup.py) egg_info for package from file:///builds/slave/test/build/tests/mozbase/mozfile 10:30:54 INFO - Requirement already satisfied (use --upgrade to upgrade): mozfile==1.2 from file:///builds/slave/test/build/tests/mozbase/mozfile in /builds/slave/test/build/venv/lib/python2.7/site-packages (from -r /builds/slave/test/build/tests/config/mozbase_requirements.txt (line 5)) 10:30:54 INFO - Unpacking /builds/slave/test/build/tests/mozbase/mozhttpd 10:30:54 INFO - Running setup.py (path:/tmp/pip-MC9466-build/setup.py) egg_info for package from file:///builds/slave/test/build/tests/mozbase/mozhttpd 10:30:54 INFO - Requirement already satisfied (use --upgrade to upgrade): mozhttpd==0.7 from file:///builds/slave/test/build/tests/mozbase/mozhttpd in /builds/slave/test/build/venv/lib/python2.7/site-packages (from -r /builds/slave/test/build/tests/config/mozbase_requirements.txt (line 6)) 10:30:54 INFO - Unpacking /builds/slave/test/build/tests/mozbase/mozinfo 10:30:54 INFO - Running setup.py (path:/tmp/pip-etZQ_L-build/setup.py) egg_info for package from file:///builds/slave/test/build/tests/mozbase/mozinfo 10:30:55 INFO - Requirement already satisfied (use --upgrade to upgrade): mozinfo==0.9 from file:///builds/slave/test/build/tests/mozbase/mozinfo in /builds/slave/test/build/venv/lib/python2.7/site-packages (from -r /builds/slave/test/build/tests/config/mozbase_requirements.txt (line 7)) 10:30:55 INFO - Unpacking /builds/slave/test/build/tests/mozbase/mozinstall 10:30:55 INFO - Running setup.py (path:/tmp/pip-eCbDB6-build/setup.py) egg_info for package from file:///builds/slave/test/build/tests/mozbase/mozinstall 10:30:55 INFO - Requirement already satisfied (use --upgrade to upgrade): mozInstall==1.12 from file:///builds/slave/test/build/tests/mozbase/mozinstall in /builds/slave/test/build/venv/lib/python2.7/site-packages (from -r /builds/slave/test/build/tests/config/mozbase_requirements.txt (line 8)) 10:30:55 INFO - Unpacking /builds/slave/test/build/tests/mozbase/mozleak 10:30:55 INFO - Running setup.py (path:/tmp/pip-gQ1K5t-build/setup.py) egg_info for package from file:///builds/slave/test/build/tests/mozbase/mozleak 10:30:55 INFO - Requirement already satisfied (use --upgrade to upgrade): mozleak==0.1 from file:///builds/slave/test/build/tests/mozbase/mozleak in /builds/slave/test/build/venv/lib/python2.7/site-packages (from -r /builds/slave/test/build/tests/config/mozbase_requirements.txt (line 9)) 10:30:55 INFO - Unpacking /builds/slave/test/build/tests/mozbase/mozlog 10:30:55 INFO - Running setup.py (path:/tmp/pip-SKsPNP-build/setup.py) egg_info for package from file:///builds/slave/test/build/tests/mozbase/mozlog 10:30:55 INFO - Requirement already satisfied (use --upgrade to upgrade): mozlog==3.3 from file:///builds/slave/test/build/tests/mozbase/mozlog in /builds/slave/test/build/venv/lib/python2.7/site-packages (from -r /builds/slave/test/build/tests/config/mozbase_requirements.txt (line 10)) 10:30:55 INFO - Unpacking /builds/slave/test/build/tests/mozbase/moznetwork 10:30:55 INFO - Running setup.py (path:/tmp/pip-F7FqQ4-build/setup.py) egg_info for package from file:///builds/slave/test/build/tests/mozbase/moznetwork 10:30:55 INFO - Requirement already satisfied (use --upgrade to upgrade): moznetwork==0.27 from file:///builds/slave/test/build/tests/mozbase/moznetwork in /builds/slave/test/build/venv/lib/python2.7/site-packages (from -r /builds/slave/test/build/tests/config/mozbase_requirements.txt (line 11)) 10:30:55 INFO - Unpacking /builds/slave/test/build/tests/mozbase/mozprocess 10:30:55 INFO - Running setup.py (path:/tmp/pip-qRnTK3-build/setup.py) egg_info for package from file:///builds/slave/test/build/tests/mozbase/mozprocess 10:30:55 INFO - Requirement already satisfied (use --upgrade to upgrade): mozprocess==0.23 from file:///builds/slave/test/build/tests/mozbase/mozprocess in /builds/slave/test/build/venv/lib/python2.7/site-packages (from -r /builds/slave/test/build/tests/config/mozbase_requirements.txt (line 12)) 10:30:55 INFO - Unpacking /builds/slave/test/build/tests/mozbase/mozprofile 10:30:55 INFO - Running setup.py (path:/tmp/pip-HFCRJE-build/setup.py) egg_info for package from file:///builds/slave/test/build/tests/mozbase/mozprofile 10:30:55 INFO - Requirement already satisfied (use --upgrade to upgrade): mozprofile==0.28 from file:///builds/slave/test/build/tests/mozbase/mozprofile in /builds/slave/test/build/venv/lib/python2.7/site-packages (from -r /builds/slave/test/build/tests/config/mozbase_requirements.txt (line 13)) 10:30:55 INFO - Unpacking /builds/slave/test/build/tests/mozbase/mozrunner 10:30:55 INFO - Running setup.py (path:/tmp/pip-5B2LJv-build/setup.py) egg_info for package from file:///builds/slave/test/build/tests/mozbase/mozrunner 10:30:56 INFO - Requirement already satisfied (use --upgrade to upgrade): mozrunner==6.12 from file:///builds/slave/test/build/tests/mozbase/mozrunner in /builds/slave/test/build/venv/lib/python2.7/site-packages (from -r /builds/slave/test/build/tests/config/mozbase_requirements.txt (line 14)) 10:30:56 INFO - Unpacking /builds/slave/test/build/tests/mozbase/mozscreenshot 10:30:56 INFO - Running setup.py (path:/tmp/pip-A4eXiY-build/setup.py) egg_info for package from file:///builds/slave/test/build/tests/mozbase/mozscreenshot 10:30:56 INFO - Requirement already satisfied (use --upgrade to upgrade): mozscreenshot==0.1 from file:///builds/slave/test/build/tests/mozbase/mozscreenshot in /builds/slave/test/build/venv/lib/python2.7/site-packages (from -r /builds/slave/test/build/tests/config/mozbase_requirements.txt (line 15)) 10:30:56 INFO - Unpacking /builds/slave/test/build/tests/mozbase/moztest 10:30:56 INFO - Running setup.py (path:/tmp/pip-aP6Eok-build/setup.py) egg_info for package from file:///builds/slave/test/build/tests/mozbase/moztest 10:30:56 INFO - Requirement already satisfied (use --upgrade to upgrade): moztest==0.7 from file:///builds/slave/test/build/tests/mozbase/moztest in /builds/slave/test/build/venv/lib/python2.7/site-packages (from -r /builds/slave/test/build/tests/config/mozbase_requirements.txt (line 16)) 10:30:56 INFO - Unpacking /builds/slave/test/build/tests/mozbase/mozversion 10:30:56 INFO - Running setup.py (path:/tmp/pip-gMGqnx-build/setup.py) egg_info for package from file:///builds/slave/test/build/tests/mozbase/mozversion 10:30:56 INFO - Requirement already satisfied (use --upgrade to upgrade): mozversion==1.4 from file:///builds/slave/test/build/tests/mozbase/mozversion in /builds/slave/test/build/venv/lib/python2.7/site-packages (from -r /builds/slave/test/build/tests/config/mozbase_requirements.txt (line 17)) 10:30:56 INFO - Unpacking /builds/slave/test/build/tests/tools/wptserve 10:30:56 INFO - Running setup.py (path:/tmp/pip-yBJl6r-build/setup.py) egg_info for package from file:///builds/slave/test/build/tests/tools/wptserve 10:30:56 INFO - Unpacking /builds/slave/test/build/tests/marionette/client 10:30:56 INFO - Running setup.py (path:/tmp/pip-XoPtbt-build/setup.py) egg_info for package from file:///builds/slave/test/build/tests/marionette/client 10:30:56 INFO - Unpacking /builds/slave/test/build/tests/marionette/marionette/runner/mixins/browsermob-proxy-py 10:30:56 INFO - Running setup.py (path:/tmp/pip-WsFHU7-build/setup.py) egg_info for package from file:///builds/slave/test/build/tests/marionette/marionette/runner/mixins/browsermob-proxy-py 10:30:56 INFO - Unpacking /builds/slave/test/build/tests/marionette 10:30:57 INFO - Running setup.py (path:/tmp/pip-Y55VHr-build/setup.py) egg_info for package from file:///builds/slave/test/build/tests/marionette 10:30:57 INFO - warning: no files found matching '*.js' under directory 'marionette/touch' 10:30:57 INFO - Installing collected packages: wptserve, marionette-driver, browsermob-proxy, marionette-client 10:30:57 INFO - Running setup.py install for wptserve 10:30:57 INFO - Running setup.py install for marionette-driver 10:30:57 INFO - Running setup.py install for browsermob-proxy 10:30:58 INFO - Running setup.py install for marionette-client 10:30:58 INFO - warning: no files found matching '*.js' under directory 'marionette/touch' 10:30:58 INFO - Installing marionette script to /builds/slave/test/build/venv/bin 10:30:58 INFO - Successfully installed wptserve marionette-driver browsermob-proxy marionette-client 10:30:58 INFO - Cleaning up... 10:30:58 INFO - Return code: 0 10:30:58 INFO - Installing None into virtualenv /builds/slave/test/build/venv 10:30:58 INFO - proxxy config: {'regions': ['.use1.', '.usw2.', '.scl3'], 'instances': ['proxxy1.srv.releng.use1.mozilla.com', 'proxxy1.srv.releng.usw2.mozilla.com', 'proxxy1.srv.releng.scl3.mozilla.com'], 'urls': [('http://ftp.mozilla.org', 'ftp.mozilla.org'), ('https://ftp.mozilla.org', 'ftp.mozilla.org'), ('https://ftp-ssl.mozilla.org', 'ftp.mozilla.org'), ('http://pvtbuilds.pvt.build.mozilla.org', 'pvtbuilds.mozilla.org'), ('http://pypi.pvt.build.mozilla.org', 'pypi.pvt.build.mozilla.org'), ('http://pypi.pub.build.mozilla.org', 'pypi.pub.build.mozilla.org'), ('https://queue.taskcluster.net', 'queue.taskcluster.net')]} 10:30:58 INFO - http://pypi.pvt.build.mozilla.org/pub matches http://pypi.pvt.build.mozilla.org 10:30:58 INFO - URL Candidate: http://pypi.pvt.build.mozilla.org.proxxy1.srv.releng.use1.mozilla.com/pub 10:30:58 INFO - proxxy config: {'regions': ['.use1.', '.usw2.', '.scl3'], 'instances': ['proxxy1.srv.releng.use1.mozilla.com', 'proxxy1.srv.releng.usw2.mozilla.com', 'proxxy1.srv.releng.scl3.mozilla.com'], 'urls': [('http://ftp.mozilla.org', 'ftp.mozilla.org'), ('https://ftp.mozilla.org', 'ftp.mozilla.org'), ('https://ftp-ssl.mozilla.org', 'ftp.mozilla.org'), ('http://pvtbuilds.pvt.build.mozilla.org', 'pvtbuilds.mozilla.org'), ('http://pypi.pvt.build.mozilla.org', 'pypi.pvt.build.mozilla.org'), ('http://pypi.pub.build.mozilla.org', 'pypi.pub.build.mozilla.org'), ('https://queue.taskcluster.net', 'queue.taskcluster.net')]} 10:30:58 INFO - http://pypi.pub.build.mozilla.org/pub matches http://pypi.pub.build.mozilla.org 10:30:58 INFO - URL Candidate: http://pypi.pub.build.mozilla.org.proxxy1.srv.releng.use1.mozilla.com/pub 10:30:58 INFO - retry: Calling run_command with args: [['/builds/slave/test/build/venv/bin/pip', 'install', '--timeout', '120', '-r', '/builds/slave/test/build/tests/config/marionette_requirements.txt', '--no-index', '--find-links', 'http://pypi.pvt.build.mozilla.org.proxxy1.srv.releng.use1.mozilla.com/pub', '--find-links', 'http://pypi.pub.build.mozilla.org.proxxy1.srv.releng.use1.mozilla.com/pub', '--find-links', 'http://pypi.pvt.build.mozilla.org/pub', '--find-links', 'http://pypi.pub.build.mozilla.org/pub']], kwargs: {'error_level': 'warning', 'error_list': [{'substr': 'not found or a compiler error:', 'level': 'warning'}, {'regex': <_sre.SRE_Pattern object at 0x21a01f0>, 'level': 'error'}, {'regex': <_sre.SRE_Pattern object at 0x7fbbdf36de40>, 'level': 'warning'}, {'regex': <_sre.SRE_Pattern object at 0x22c3df0>, 'level': 'debug'}, {'substr': 'command not found', 'level': 'error'}, {'regex': <_sre.SRE_Pattern object at 0x22bff90>, 'level': 'warning'}, {'substr': 'Traceback (most recent call last)', 'level': 'error'}, {'substr': 'SyntaxError: ', 'level': 'error'}, {'substr': 'TypeError: ', 'level': 'error'}, {'substr': 'NameError: ', 'level': 'error'}, {'substr': 'ZeroDivisionError: ', 'level': 'error'}, {'regex': <_sre.SRE_Pattern object at 0x22c18f0>, 'level': 'critical'}, {'regex': <_sre.SRE_Pattern object at 0x22c1b70>, 'level': 'critical'}], 'cwd': '/builds/slave/test/build/tests/config', 'env': {'LANG': 'en_US.UTF-8', 'TERM': 'linux', 'SHELL': '/bin/bash', 'XDG_SESSION_COOKIE': '9ca12473fbb1d023794ffd180000023c-1470245005.707928-777100845', 'MAIL': '/var/mail/cltbld', 'SHLVL': '1', 'TMOUT': '86400', 'NODE_PATH': '/usr/lib/nodejs:/usr/lib/node_modules:/usr/share/javascript', 'PWD': '/builds/slave/test', 'LOGNAME': 'cltbld', 'USER': 'cltbld', 'PROPERTIES_FILE': '/builds/slave/test/buildprops.json', 'PATH': '/usr/local/bin:/usr/local/bin:/usr/bin:/bin:/usr/local/games:/usr/games', 'HOME': '/home/cltbld', 'DISPLAY': ':0', '_': '/tools/buildbot/bin/python'}}, attempt #1 10:30:58 INFO - Running command: ['/builds/slave/test/build/venv/bin/pip', 'install', '--timeout', '120', '-r', '/builds/slave/test/build/tests/config/marionette_requirements.txt', '--no-index', '--find-links', 'http://pypi.pvt.build.mozilla.org.proxxy1.srv.releng.use1.mozilla.com/pub', '--find-links', 'http://pypi.pub.build.mozilla.org.proxxy1.srv.releng.use1.mozilla.com/pub', '--find-links', 'http://pypi.pvt.build.mozilla.org/pub', '--find-links', 'http://pypi.pub.build.mozilla.org/pub'] in /builds/slave/test/build/tests/config 10:30:58 INFO - Copy/paste: /builds/slave/test/build/venv/bin/pip install --timeout 120 -r /builds/slave/test/build/tests/config/marionette_requirements.txt --no-index --find-links http://pypi.pvt.build.mozilla.org.proxxy1.srv.releng.use1.mozilla.com/pub --find-links http://pypi.pub.build.mozilla.org.proxxy1.srv.releng.use1.mozilla.com/pub --find-links http://pypi.pvt.build.mozilla.org/pub --find-links http://pypi.pub.build.mozilla.org/pub 10:30:58 INFO - Using env: {'DISPLAY': ':0', 10:30:58 INFO - 'HOME': '/home/cltbld', 10:30:58 INFO - 'LANG': 'en_US.UTF-8', 10:30:58 INFO - 'LOGNAME': 'cltbld', 10:30:58 INFO - 'MAIL': '/var/mail/cltbld', 10:30:58 INFO - 'NODE_PATH': '/usr/lib/nodejs:/usr/lib/node_modules:/usr/share/javascript', 10:30:58 INFO - 'PATH': '/usr/local/bin:/usr/local/bin:/usr/bin:/bin:/usr/local/games:/usr/games', 10:30:58 INFO - 'PROPERTIES_FILE': '/builds/slave/test/buildprops.json', 10:30:58 INFO - 'PWD': '/builds/slave/test', 10:30:58 INFO - 'SHELL': '/bin/bash', 10:30:58 INFO - 'SHLVL': '1', 10:30:58 INFO - 'TERM': 'linux', 10:30:58 INFO - 'TMOUT': '86400', 10:30:58 INFO - 'USER': 'cltbld', 10:30:58 INFO - 'XDG_SESSION_COOKIE': '9ca12473fbb1d023794ffd180000023c-1470245005.707928-777100845', 10:30:58 INFO - '_': '/tools/buildbot/bin/python'} 10:30:59 INFO - Ignoring indexes: https://pypi.python.org/simple/ 10:30:59 INFO - Unpacking /builds/slave/test/build/tests/mozbase/manifestparser 10:30:59 INFO - Running setup.py (path:/tmp/pip-HEp7tj-build/setup.py) egg_info for package from file:///builds/slave/test/build/tests/mozbase/manifestparser 10:30:59 INFO - Requirement already satisfied (use --upgrade to upgrade): manifestparser==1.1 from file:///builds/slave/test/build/tests/mozbase/manifestparser in /builds/slave/test/build/venv/lib/python2.7/site-packages (from -r /builds/slave/test/build/tests/config/mozbase_requirements.txt (line 1)) 10:30:59 INFO - Unpacking /builds/slave/test/build/tests/mozbase/mozcrash 10:30:59 INFO - Running setup.py (path:/tmp/pip-N477LN-build/setup.py) egg_info for package from file:///builds/slave/test/build/tests/mozbase/mozcrash 10:30:59 INFO - Requirement already satisfied (use --upgrade to upgrade): mozcrash==0.17 from file:///builds/slave/test/build/tests/mozbase/mozcrash in /builds/slave/test/build/venv/lib/python2.7/site-packages (from -r /builds/slave/test/build/tests/config/mozbase_requirements.txt (line 2)) 10:30:59 INFO - Unpacking /builds/slave/test/build/tests/mozbase/mozdebug 10:30:59 INFO - Running setup.py (path:/tmp/pip-KGCkeJ-build/setup.py) egg_info for package from file:///builds/slave/test/build/tests/mozbase/mozdebug 10:30:59 INFO - Requirement already satisfied (use --upgrade to upgrade): mozdebug==0.1 from file:///builds/slave/test/build/tests/mozbase/mozdebug in /builds/slave/test/build/venv/lib/python2.7/site-packages (from -r /builds/slave/test/build/tests/config/mozbase_requirements.txt (line 3)) 10:30:59 INFO - Unpacking /builds/slave/test/build/tests/mozbase/mozdevice 10:30:59 INFO - Running setup.py (path:/tmp/pip-c26xNd-build/setup.py) egg_info for package from file:///builds/slave/test/build/tests/mozbase/mozdevice 10:30:59 INFO - Requirement already satisfied (use --upgrade to upgrade): mozdevice==0.48 from file:///builds/slave/test/build/tests/mozbase/mozdevice in /builds/slave/test/build/venv/lib/python2.7/site-packages (from -r /builds/slave/test/build/tests/config/mozbase_requirements.txt (line 4)) 10:30:59 INFO - Unpacking /builds/slave/test/build/tests/mozbase/mozfile 10:30:59 INFO - Running setup.py (path:/tmp/pip-DxbBBw-build/setup.py) egg_info for package from file:///builds/slave/test/build/tests/mozbase/mozfile 10:30:59 INFO - Requirement already satisfied (use --upgrade to upgrade): mozfile==1.2 from file:///builds/slave/test/build/tests/mozbase/mozfile in /builds/slave/test/build/venv/lib/python2.7/site-packages (from -r /builds/slave/test/build/tests/config/mozbase_requirements.txt (line 5)) 10:30:59 INFO - Unpacking /builds/slave/test/build/tests/mozbase/mozhttpd 10:30:59 INFO - Running setup.py (path:/tmp/pip-NQVjLn-build/setup.py) egg_info for package from file:///builds/slave/test/build/tests/mozbase/mozhttpd 10:30:59 INFO - Requirement already satisfied (use --upgrade to upgrade): mozhttpd==0.7 from file:///builds/slave/test/build/tests/mozbase/mozhttpd in /builds/slave/test/build/venv/lib/python2.7/site-packages (from -r /builds/slave/test/build/tests/config/mozbase_requirements.txt (line 6)) 10:30:59 INFO - Unpacking /builds/slave/test/build/tests/mozbase/mozinfo 10:30:59 INFO - Running setup.py (path:/tmp/pip-ASsP_i-build/setup.py) egg_info for package from file:///builds/slave/test/build/tests/mozbase/mozinfo 10:31:00 INFO - Requirement already satisfied (use --upgrade to upgrade): mozinfo==0.9 from file:///builds/slave/test/build/tests/mozbase/mozinfo in /builds/slave/test/build/venv/lib/python2.7/site-packages (from -r /builds/slave/test/build/tests/config/mozbase_requirements.txt (line 7)) 10:31:00 INFO - Unpacking /builds/slave/test/build/tests/mozbase/mozinstall 10:31:00 INFO - Running setup.py (path:/tmp/pip-rBFuEU-build/setup.py) egg_info for package from file:///builds/slave/test/build/tests/mozbase/mozinstall 10:31:00 INFO - Requirement already satisfied (use --upgrade to upgrade): mozInstall==1.12 from file:///builds/slave/test/build/tests/mozbase/mozinstall in /builds/slave/test/build/venv/lib/python2.7/site-packages (from -r /builds/slave/test/build/tests/config/mozbase_requirements.txt (line 8)) 10:31:00 INFO - Unpacking /builds/slave/test/build/tests/mozbase/mozleak 10:31:00 INFO - Running setup.py (path:/tmp/pip-u2ASSb-build/setup.py) egg_info for package from file:///builds/slave/test/build/tests/mozbase/mozleak 10:31:00 INFO - Requirement already satisfied (use --upgrade to upgrade): mozleak==0.1 from file:///builds/slave/test/build/tests/mozbase/mozleak in /builds/slave/test/build/venv/lib/python2.7/site-packages (from -r /builds/slave/test/build/tests/config/mozbase_requirements.txt (line 9)) 10:31:00 INFO - Unpacking /builds/slave/test/build/tests/mozbase/mozlog 10:31:00 INFO - Running setup.py (path:/tmp/pip-pmJD9y-build/setup.py) egg_info for package from file:///builds/slave/test/build/tests/mozbase/mozlog 10:31:00 INFO - Requirement already satisfied (use --upgrade to upgrade): mozlog==3.3 from file:///builds/slave/test/build/tests/mozbase/mozlog in /builds/slave/test/build/venv/lib/python2.7/site-packages (from -r /builds/slave/test/build/tests/config/mozbase_requirements.txt (line 10)) 10:31:00 INFO - Unpacking /builds/slave/test/build/tests/mozbase/moznetwork 10:31:00 INFO - Running setup.py (path:/tmp/pip-8W_8Z4-build/setup.py) egg_info for package from file:///builds/slave/test/build/tests/mozbase/moznetwork 10:31:00 INFO - Requirement already satisfied (use --upgrade to upgrade): moznetwork==0.27 from file:///builds/slave/test/build/tests/mozbase/moznetwork in /builds/slave/test/build/venv/lib/python2.7/site-packages (from -r /builds/slave/test/build/tests/config/mozbase_requirements.txt (line 11)) 10:31:00 INFO - Unpacking /builds/slave/test/build/tests/mozbase/mozprocess 10:31:00 INFO - Running setup.py (path:/tmp/pip-GnDAB5-build/setup.py) egg_info for package from file:///builds/slave/test/build/tests/mozbase/mozprocess 10:31:00 INFO - Requirement already satisfied (use --upgrade to upgrade): mozprocess==0.23 from file:///builds/slave/test/build/tests/mozbase/mozprocess in /builds/slave/test/build/venv/lib/python2.7/site-packages (from -r /builds/slave/test/build/tests/config/mozbase_requirements.txt (line 12)) 10:31:00 INFO - Unpacking /builds/slave/test/build/tests/mozbase/mozprofile 10:31:00 INFO - Running setup.py (path:/tmp/pip-eIzrQM-build/setup.py) egg_info for package from file:///builds/slave/test/build/tests/mozbase/mozprofile 10:31:00 INFO - Requirement already satisfied (use --upgrade to upgrade): mozprofile==0.28 from file:///builds/slave/test/build/tests/mozbase/mozprofile in /builds/slave/test/build/venv/lib/python2.7/site-packages (from -r /builds/slave/test/build/tests/config/mozbase_requirements.txt (line 13)) 10:31:00 INFO - Unpacking /builds/slave/test/build/tests/mozbase/mozrunner 10:31:00 INFO - Running setup.py (path:/tmp/pip-YQu92j-build/setup.py) egg_info for package from file:///builds/slave/test/build/tests/mozbase/mozrunner 10:31:01 INFO - Requirement already satisfied (use --upgrade to upgrade): mozrunner==6.12 from file:///builds/slave/test/build/tests/mozbase/mozrunner in /builds/slave/test/build/venv/lib/python2.7/site-packages (from -r /builds/slave/test/build/tests/config/mozbase_requirements.txt (line 14)) 10:31:01 INFO - Unpacking /builds/slave/test/build/tests/mozbase/mozscreenshot 10:31:01 INFO - Running setup.py (path:/tmp/pip-NBdKym-build/setup.py) egg_info for package from file:///builds/slave/test/build/tests/mozbase/mozscreenshot 10:31:01 INFO - Requirement already satisfied (use --upgrade to upgrade): mozscreenshot==0.1 from file:///builds/slave/test/build/tests/mozbase/mozscreenshot in /builds/slave/test/build/venv/lib/python2.7/site-packages (from -r /builds/slave/test/build/tests/config/mozbase_requirements.txt (line 15)) 10:31:01 INFO - Unpacking /builds/slave/test/build/tests/mozbase/moztest 10:31:01 INFO - Running setup.py (path:/tmp/pip-qw2u0Z-build/setup.py) egg_info for package from file:///builds/slave/test/build/tests/mozbase/moztest 10:31:01 INFO - Requirement already satisfied (use --upgrade to upgrade): moztest==0.7 from file:///builds/slave/test/build/tests/mozbase/moztest in /builds/slave/test/build/venv/lib/python2.7/site-packages (from -r /builds/slave/test/build/tests/config/mozbase_requirements.txt (line 16)) 10:31:01 INFO - Unpacking /builds/slave/test/build/tests/mozbase/mozversion 10:31:01 INFO - Running setup.py (path:/tmp/pip-Rx_iPO-build/setup.py) egg_info for package from file:///builds/slave/test/build/tests/mozbase/mozversion 10:31:01 INFO - Requirement already satisfied (use --upgrade to upgrade): mozversion==1.4 from file:///builds/slave/test/build/tests/mozbase/mozversion in /builds/slave/test/build/venv/lib/python2.7/site-packages (from -r /builds/slave/test/build/tests/config/mozbase_requirements.txt (line 17)) 10:31:01 INFO - Unpacking /builds/slave/test/build/tests/tools/wptserve 10:31:01 INFO - Running setup.py (path:/tmp/pip-y76MzM-build/setup.py) egg_info for package from file:///builds/slave/test/build/tests/tools/wptserve 10:31:01 INFO - Requirement already satisfied (use --upgrade to upgrade): wptserve==1.4.0 from file:///builds/slave/test/build/tests/tools/wptserve in /builds/slave/test/build/venv/lib/python2.7/site-packages (from -r /builds/slave/test/build/tests/config/marionette_requirements.txt (line 2)) 10:31:01 INFO - Unpacking /builds/slave/test/build/tests/marionette/client 10:31:01 INFO - Running setup.py (path:/tmp/pip-BoQvZ9-build/setup.py) egg_info for package from file:///builds/slave/test/build/tests/marionette/client 10:31:01 INFO - Requirement already satisfied (use --upgrade to upgrade): marionette-driver==2.0.0 from file:///builds/slave/test/build/tests/marionette/client in /builds/slave/test/build/venv/lib/python2.7/site-packages (from -r /builds/slave/test/build/tests/config/marionette_requirements.txt (line 3)) 10:31:01 INFO - Unpacking /builds/slave/test/build/tests/marionette/marionette/runner/mixins/browsermob-proxy-py 10:31:01 INFO - Running setup.py (path:/tmp/pip-bhdTj1-build/setup.py) egg_info for package from file:///builds/slave/test/build/tests/marionette/marionette/runner/mixins/browsermob-proxy-py 10:31:02 INFO - Requirement already satisfied (use --upgrade to upgrade): browsermob-proxy==0.6.0 from file:///builds/slave/test/build/tests/marionette/marionette/runner/mixins/browsermob-proxy-py in /builds/slave/test/build/venv/lib/python2.7/site-packages (from -r /builds/slave/test/build/tests/config/marionette_requirements.txt (line 4)) 10:31:02 INFO - Unpacking /builds/slave/test/build/tests/marionette 10:31:02 INFO - Running setup.py (path:/tmp/pip-dmGbPp-build/setup.py) egg_info for package from file:///builds/slave/test/build/tests/marionette 10:31:02 INFO - warning: no files found matching '*.js' under directory 'marionette/touch' 10:31:02 INFO - Requirement already satisfied (use --upgrade to upgrade): marionette-client==3.1.0 from file:///builds/slave/test/build/tests/marionette in /builds/slave/test/build/venv/lib/python2.7/site-packages (from -r /builds/slave/test/build/tests/config/marionette_requirements.txt (line 5)) 10:31:02 INFO - Requirement already satisfied (use --upgrade to upgrade): mozfile>=1.0 in /builds/slave/test/build/venv/lib/python2.7/site-packages (from mozcrash==0.17->-r /builds/slave/test/build/tests/config/mozbase_requirements.txt (line 2)) 10:31:02 INFO - Requirement already satisfied (use --upgrade to upgrade): mozlog>=3.0 in /builds/slave/test/build/venv/lib/python2.7/site-packages (from mozcrash==0.17->-r /builds/slave/test/build/tests/config/mozbase_requirements.txt (line 2)) 10:31:02 INFO - Requirement already satisfied (use --upgrade to upgrade): mozinfo in /builds/slave/test/build/venv/lib/python2.7/site-packages (from mozdebug==0.1->-r /builds/slave/test/build/tests/config/mozbase_requirements.txt (line 3)) 10:31:02 INFO - Requirement already satisfied (use --upgrade to upgrade): moznetwork>=0.24 in /builds/slave/test/build/venv/lib/python2.7/site-packages (from mozdevice==0.48->-r /builds/slave/test/build/tests/config/mozbase_requirements.txt (line 4)) 10:31:02 INFO - Requirement already satisfied (use --upgrade to upgrade): mozprocess>=0.19 in /builds/slave/test/build/venv/lib/python2.7/site-packages (from mozdevice==0.48->-r /builds/slave/test/build/tests/config/mozbase_requirements.txt (line 4)) 10:31:02 INFO - Requirement already satisfied (use --upgrade to upgrade): blessings>=1.3 in /builds/slave/test/build/venv/lib/python2.7/site-packages (from mozlog==3.3->-r /builds/slave/test/build/tests/config/mozbase_requirements.txt (line 10)) 10:31:02 INFO - Requirement already satisfied (use --upgrade to upgrade): requests>=1.1.0 in /builds/slave/test/build/venv/lib/python2.7/site-packages (from browsermob-proxy==0.6.0->-r /builds/slave/test/build/tests/config/marionette_requirements.txt (line 4)) 10:31:02 INFO - Cleaning up... 10:31:02 INFO - Return code: 0 10:31:02 INFO - Done creating virtualenv /builds/slave/test/build/venv. 10:31:02 INFO - Getting output from command: ['/builds/slave/test/build/venv/bin/pip', 'freeze'] 10:31:02 INFO - Copy/paste: /builds/slave/test/build/venv/bin/pip freeze 10:31:02 INFO - Reading from file tmpfile_stdout 10:31:02 INFO - Current package versions: 10:31:02 INFO - argparse == 1.2.1 10:31:02 INFO - blessings == 1.6 10:31:02 INFO - blobuploader == 1.2.4 10:31:02 INFO - browsermob-proxy == 0.6.0 10:31:02 INFO - docopt == 0.6.1 10:31:02 INFO - functools32 == 3.2.3-2 10:31:02 INFO - jsonschema == 2.5.1 10:31:02 INFO - manifestparser == 1.1 10:31:02 INFO - marionette-client == 3.1.0 10:31:02 INFO - marionette-driver == 2.0.0 10:31:02 INFO - mock == 1.0.1 10:31:02 INFO - mozInstall == 1.12 10:31:02 INFO - mozcrash == 0.17 10:31:02 INFO - mozdebug == 0.1 10:31:02 INFO - mozdevice == 0.48 10:31:02 INFO - mozfile == 1.2 10:31:02 INFO - mozhttpd == 0.7 10:31:02 INFO - mozinfo == 0.9 10:31:02 INFO - mozleak == 0.1 10:31:02 INFO - mozlog == 3.3 10:31:02 INFO - moznetwork == 0.27 10:31:02 INFO - mozprocess == 0.23 10:31:02 INFO - mozprofile == 0.28 10:31:02 INFO - mozrunner == 6.12 10:31:02 INFO - mozscreenshot == 0.1 10:31:02 INFO - mozsystemmonitor == 0.3 10:31:02 INFO - moztest == 0.7 10:31:02 INFO - mozversion == 1.4 10:31:02 INFO - psutil == 3.1.1 10:31:02 INFO - requests == 1.2.3 10:31:02 INFO - simplejson == 3.3.0 10:31:02 INFO - wptserve == 1.4.0 10:31:02 INFO - wsgiref == 0.1.2 10:31:02 INFO - Running post-action listener: _resource_record_post_action 10:31:02 INFO - Running post-action listener: _start_resource_monitoring 10:31:03 INFO - Starting resource monitoring. 10:31:03 INFO - [mozharness: 2016-08-03 17:31:03.034932Z] Finished create-virtualenv step (success) 10:31:03 INFO - [mozharness: 2016-08-03 17:31:03.041089Z] Running install step. 10:31:03 INFO - Running pre-action listener: _resource_record_pre_action 10:31:03 INFO - Running main action method: install 10:31:03 INFO - Getting output from command: ['/builds/slave/test/build/venv/bin/pip', 'freeze'] 10:31:03 INFO - Copy/paste: /builds/slave/test/build/venv/bin/pip freeze 10:31:03 INFO - Reading from file tmpfile_stdout 10:31:03 INFO - Detecting whether we're running mozinstall >=1.0... 10:31:03 INFO - Getting output from command: ['/builds/slave/test/build/venv/bin/mozinstall', '-h'] 10:31:03 INFO - Copy/paste: /builds/slave/test/build/venv/bin/mozinstall -h 10:31:03 INFO - Reading from file tmpfile_stdout 10:31:03 INFO - Output received: 10:31:03 INFO - Usage: mozinstall [options] installer 10:31:03 INFO - Options: 10:31:03 INFO - -h, --help show this help message and exit 10:31:03 INFO - -d DEST, --destination=DEST 10:31:03 INFO - Directory to install application into. [default: 10:31:03 INFO - "/builds/slave/test"] 10:31:03 INFO - --app=APP Application being installed. [default: firefox] 10:31:03 INFO - mkdir: /builds/slave/test/build/application 10:31:03 INFO - Getting output from command: ['/builds/slave/test/build/venv/bin/mozinstall', '/builds/slave/test/build/installer.tar.bz2', '--destination', '/builds/slave/test/build/application'] 10:31:03 INFO - Copy/paste: /builds/slave/test/build/venv/bin/mozinstall /builds/slave/test/build/installer.tar.bz2 --destination /builds/slave/test/build/application 10:32:51 INFO - Reading from file tmpfile_stdout 10:32:51 INFO - Output received: 10:32:51 INFO - /builds/slave/test/build/application/firefox/firefox 10:32:51 INFO - Running post-action listener: _resource_record_post_action 10:32:51 INFO - [mozharness: 2016-08-03 17:32:51.615430Z] Finished install step (success) 10:32:51 INFO - [mozharness: 2016-08-03 17:32:51.615799Z] Running stage-files step. 10:32:51 INFO - Running pre-action listener: _resource_record_pre_action 10:32:51 INFO - Running main action method: stage_files 10:32:51 INFO - Running post-action listener: _resource_record_post_action 10:32:51 INFO - [mozharness: 2016-08-03 17:32:51.617862Z] Finished stage-files step (success) 10:32:51 INFO - [mozharness: 2016-08-03 17:32:51.618191Z] Running run-tests step. 10:32:51 INFO - Running pre-action listener: _resource_record_pre_action 10:32:51 INFO - Running pre-action listener: _set_gcov_prefix 10:32:51 INFO - Running main action method: run_tests 10:32:51 INFO - Running pre test command disable_screen_saver with 'xset s off s reset' 10:32:51 INFO - Running command: ['xset', 's', 'off', 's', 'reset'] in /builds/slave/test/build 10:32:51 INFO - Copy/paste: xset s off s reset 10:32:51 INFO - Return code: 0 10:32:51 INFO - #### Running reftest suites 10:32:51 INFO - finding symbols_url based upon self.installer_url 10:32:51 INFO - setting symbols_url as https://queue.taskcluster.net/v1/task/K3PRIIzlTx60gLnmQg3gVg/artifacts/public/build/firefox-51.0a1.en-US.linux-x86_64-asan.crashreporter-symbols.zip /builds/slave/test/build/venv/lib/python2.7/site-packages/mozrunner/utils.py:20: UserWarning: Module simplejson was already imported from /tools/buildbot/local/lib/python2.7/site-packages/simplejson/__init__.pyc, but /builds/slave/test/build/venv/lib/python2.7/site-packages is being added to sys.path import pkg_resources /builds/slave/test/build/venv/lib/python2.7/site-packages/mozrunner/utils.py:20: UserWarning: Module mozprocess was already imported from /builds/slave/test/scripts/mozprocess/__init__.py, but /builds/slave/test/build/venv/lib/python2.7/site-packages is being added to sys.path import pkg_resources 10:32:52 INFO - grabbing minidump binary from tooltool 10:32:52 INFO - proxxy config: {'regions': ['.use1.', '.usw2.', '.scl3'], 'instances': ['proxxy1.srv.releng.use1.mozilla.com', 'proxxy1.srv.releng.usw2.mozilla.com', 'proxxy1.srv.releng.scl3.mozilla.com'], 'urls': [('http://ftp.mozilla.org', 'ftp.mozilla.org'), ('https://ftp.mozilla.org', 'ftp.mozilla.org'), ('https://ftp-ssl.mozilla.org', 'ftp.mozilla.org'), ('http://pvtbuilds.pvt.build.mozilla.org', 'pvtbuilds.mozilla.org'), ('http://pypi.pvt.build.mozilla.org', 'pypi.pvt.build.mozilla.org'), ('http://pypi.pub.build.mozilla.org', 'pypi.pub.build.mozilla.org'), ('https://queue.taskcluster.net', 'queue.taskcluster.net')]} 10:32:52 INFO - retry: Calling run_command with args: (['/tools/tooltool.py', '--url', 'https://api.pub.build.mozilla.org/tooltool/', '--authentication-file', '/builds/relengapi.tok', 'fetch', '-m', '/builds/slave/test/build/tests/config/tooltool-manifests/linux64/releng.manifest', '-o', '-c', '/builds/tooltool_cache'],), kwargs: {'output_timeout': 600, 'error_list': [{'substr': 'command not found', 'level': 'error'}, {'regex': <_sre.SRE_Pattern object at 0x22bff90>, 'level': 'warning'}, {'substr': 'Traceback (most recent call last)', 'level': 'error'}, {'substr': 'SyntaxError: ', 'level': 'error'}, {'substr': 'TypeError: ', 'level': 'error'}, {'substr': 'NameError: ', 'level': 'error'}, {'substr': 'ZeroDivisionError: ', 'level': 'error'}, {'regex': <_sre.SRE_Pattern object at 0x22c18f0>, 'level': 'critical'}, {'regex': <_sre.SRE_Pattern object at 0x22c1b70>, 'level': 'critical'}, {'substr': 'ERROR - ', 'level': 'error'}], 'cwd': '/builds/slave/test/build', 'privileged': False}, attempt #1 10:32:52 INFO - Running command: ['/tools/tooltool.py', '--url', 'https://api.pub.build.mozilla.org/tooltool/', '--authentication-file', '/builds/relengapi.tok', 'fetch', '-m', '/builds/slave/test/build/tests/config/tooltool-manifests/linux64/releng.manifest', '-o', '-c', '/builds/tooltool_cache'] in /builds/slave/test/build 10:32:52 INFO - Copy/paste: /tools/tooltool.py --url https://api.pub.build.mozilla.org/tooltool/ --authentication-file /builds/relengapi.tok fetch -m /builds/slave/test/build/tests/config/tooltool-manifests/linux64/releng.manifest -o -c /builds/tooltool_cache 10:32:52 INFO - Calling ['/tools/tooltool.py', '--url', 'https://api.pub.build.mozilla.org/tooltool/', '--authentication-file', '/builds/relengapi.tok', 'fetch', '-m', '/builds/slave/test/build/tests/config/tooltool-manifests/linux64/releng.manifest', '-o', '-c', '/builds/tooltool_cache'] with output_timeout 600 10:32:52 INFO - INFO - File linux64-minidump_stackwalk retrieved from local cache /builds/tooltool_cache 10:32:52 INFO - Return code: 0 10:32:52 INFO - Chmoding /builds/slave/test/build/linux64-minidump_stackwalk to 0755 10:32:52 INFO - mkdir: /builds/slave/test/build/blobber_upload_dir 10:32:52 INFO - ENV: MOZ_UPLOAD_DIR is now /builds/slave/test/build/blobber_upload_dir 10:32:52 INFO - ENV: MINIDUMP_STACKWALK is now /builds/slave/test/build/linux64-minidump_stackwalk 10:32:52 INFO - ENV: MINIDUMP_SAVE_PATH is now /builds/slave/test/build/blobber_upload_dir 10:32:52 INFO - Running command: ['/builds/slave/test/build/venv/bin/python', '-u', '/builds/slave/test/build/tests/reftest/runreftest.py', '--disable-e10s', '--appname=/builds/slave/test/build/application/firefox/firefox', '--utility-path=tests/bin', '--extra-profile-file=tests/bin/plugins', '--symbols-path=https://queue.taskcluster.net/v1/task/K3PRIIzlTx60gLnmQg3gVg/artifacts/public/build/firefox-51.0a1.en-US.linux-x86_64-asan.crashreporter-symbols.zip', '--log-raw=/builds/slave/test/build/blobber_upload_dir/jsreftest_raw.log', '--log-errorsummary=/builds/slave/test/build/blobber_upload_dir/jsreftest_errorsummary.log', '--cleanup-crashes', '--extra-profile-file=tests/jsreftest/tests/user.js', '--suite=jstestbrowser', '--', 'tests/jsreftest/tests/jstests.list'] in /builds/slave/test/build 10:32:52 INFO - Copy/paste: /builds/slave/test/build/venv/bin/python -u /builds/slave/test/build/tests/reftest/runreftest.py --disable-e10s --appname=/builds/slave/test/build/application/firefox/firefox --utility-path=tests/bin --extra-profile-file=tests/bin/plugins --symbols-path=https://queue.taskcluster.net/v1/task/K3PRIIzlTx60gLnmQg3gVg/artifacts/public/build/firefox-51.0a1.en-US.linux-x86_64-asan.crashreporter-symbols.zip --log-raw=/builds/slave/test/build/blobber_upload_dir/jsreftest_raw.log --log-errorsummary=/builds/slave/test/build/blobber_upload_dir/jsreftest_errorsummary.log --cleanup-crashes --extra-profile-file=tests/jsreftest/tests/user.js --suite=jstestbrowser -- tests/jsreftest/tests/jstests.list 10:32:52 INFO - Using env: {'DISPLAY': ':0', 10:32:52 INFO - 'HOME': '/home/cltbld', 10:32:52 INFO - 'LANG': 'en_US.UTF-8', 10:32:52 INFO - 'LOGNAME': 'cltbld', 10:32:52 INFO - 'MAIL': '/var/mail/cltbld', 10:32:52 INFO - 'MINIDUMP_SAVE_PATH': '/builds/slave/test/build/blobber_upload_dir', 10:32:52 INFO - 'MINIDUMP_STACKWALK': '/builds/slave/test/build/linux64-minidump_stackwalk', 10:32:52 INFO - 'MOZ_UPLOAD_DIR': '/builds/slave/test/build/blobber_upload_dir', 10:32:52 INFO - 'NODE_PATH': '/usr/lib/nodejs:/usr/lib/node_modules:/usr/share/javascript', 10:32:52 INFO - 'PATH': '/builds/slave/test/build/venv/bin:/usr/local/bin:/usr/local/bin:/usr/bin:/bin:/usr/local/games:/usr/games', 10:32:52 INFO - 'PROPERTIES_FILE': '/builds/slave/test/buildprops.json', 10:32:52 INFO - 'PWD': '/builds/slave/test', 10:32:52 INFO - 'SHELL': '/bin/bash', 10:32:52 INFO - 'SHLVL': '1', 10:32:52 INFO - 'TERM': 'linux', 10:32:52 INFO - 'TMOUT': '86400', 10:32:52 INFO - 'USER': 'cltbld', 10:32:52 INFO - 'XDG_SESSION_COOKIE': '9ca12473fbb1d023794ffd180000023c-1470245005.707928-777100845', 10:32:52 INFO - '_': '/tools/buildbot/bin/python'} 10:32:52 INFO - Calling ['/builds/slave/test/build/venv/bin/python', '-u', '/builds/slave/test/build/tests/reftest/runreftest.py', '--disable-e10s', '--appname=/builds/slave/test/build/application/firefox/firefox', '--utility-path=tests/bin', '--extra-profile-file=tests/bin/plugins', '--symbols-path=https://queue.taskcluster.net/v1/task/K3PRIIzlTx60gLnmQg3gVg/artifacts/public/build/firefox-51.0a1.en-US.linux-x86_64-asan.crashreporter-symbols.zip', '--log-raw=/builds/slave/test/build/blobber_upload_dir/jsreftest_raw.log', '--log-errorsummary=/builds/slave/test/build/blobber_upload_dir/jsreftest_errorsummary.log', '--cleanup-crashes', '--extra-profile-file=tests/jsreftest/tests/user.js', '--suite=jstestbrowser', '--', 'tests/jsreftest/tests/jstests.list'] with output_timeout 1000 10:32:52 INFO - REFTEST INFO | Checking for orphan ssltunnel processes... 10:32:53 INFO - REFTEST INFO | Checking for orphan xpcshell processes... 10:32:53 INFO - REFTEST INFO | INFO | runtests.py | ASan using symbolizer at /builds/slave/test/build/application/firefox/llvm-symbolizer 10:32:53 INFO - REFTEST INFO | INFO | runtests.py | ASan running in low-memory configuration 10:32:53 INFO - REFTEST INFO | Running with e10s: False 10:32:53 INFO - Couldn't load XPCOM. 10:34:53 INFO - Traceback (most recent call last): 10:34:53 INFO - File "/builds/slave/test/build/tests/reftest/runreftest.py", line 749, in 10:34:53 INFO - sys.exit(run()) 10:34:53 INFO - File "/builds/slave/test/build/tests/reftest/runreftest.py", line 745, in run 10:34:53 INFO - return reftest.runTests(options.tests, options) 10:34:53 INFO - File "/builds/slave/test/build/tests/reftest/runreftest.py", line 426, in runTests 10:34:53 INFO - return self.runSerialTests(manifests, options, cmdargs) 10:34:53 INFO - File "/builds/slave/test/build/tests/reftest/runreftest.py", line 681, in runSerialTests 10:34:53 INFO - debuggerInfo=debuggerInfo) 10:34:53 INFO - File "/builds/slave/test/build/tests/reftest/runreftest.py", line 622, in runApp 10:34:53 INFO - marionette.start_session(timeout=options.marionette_port_timeout) 10:34:53 INFO - File "/builds/slave/test/build/venv/local/lib/python2.7/site-packages/marionette_driver/marionette.py", line 1126, in start_session 10:34:53 INFO - self.protocol, _ = self.client.connect() 10:34:53 INFO - File "/builds/slave/test/build/venv/local/lib/python2.7/site-packages/marionette_driver/transport.py", line 213, in connect 10:34:53 INFO - self.sock.connect((self.addr, self.port)) 10:34:53 INFO - File "/usr/lib/python2.7/socket.py", line 224, in meth 10:34:53 INFO - return getattr(self._sock,name)(*args) 10:34:53 INFO - socket.error: [Errno 111] Connection refused 10:34:53 ERROR - Return code: 1 10:34:53 ERROR - No tests run or test summary not found 10:34:53 INFO - TinderboxPrint: reftest-jsreftest
T-FAIL 10:34:53 WARNING - # TBPL FAILURE # 10:34:53 WARNING - setting return code to 2 10:34:53 WARNING - The reftest suite: jsreftest ran with return status: FAILURE 10:34:53 INFO - Running post-action listener: _package_coverage_data 10:34:53 INFO - Running post-action listener: _resource_record_post_action 10:34:53 INFO - [mozharness: 2016-08-03 17:34:53.399917Z] Finished run-tests step (success) 10:34:53 INFO - Running post-run listener: _resource_record_post_run 10:34:53 INFO - Validating Perfherder data against /builds/slave/test/scripts/external_tools/performance-artifact-schema.json 10:34:53 INFO - PERFHERDER_DATA: {"framework": {"name": "job_resource_usage"}, "suites": [{"subtests": [{"name": "cpu_percent", "value": 48.27086956521739}, {"name": "io_write_bytes", "value": 818397184}, {"name": "io.read_bytes", "value": 2338816}, {"name": "io_write_time", "value": 950524}, {"name": "io_read_time", "value": 584}], "extraOptions": [], "name": "reftest.jsreftest.overall"}, {"subtests": [{"name": "time", "value": 108.57335782051086}, {"name": "cpu_percent", "value": 100.0}], "name": "reftest.jsreftest.install"}, {"subtests": [{"name": "time", "value": 0.0009458065032958984}], "name": "reftest.jsreftest.stage-files"}, {"subtests": [{"name": "time", "value": 121.78078889846802}, {"name": "cpu_percent", "value": 1.671900826446281}], "name": "reftest.jsreftest.run-tests"}]} 10:34:53 INFO - Total resource usage - Wall time: 230s; CPU: 2.0%; Read bytes: 2338816; Write bytes: 818397184; Read time: 584; Write time: 950524 10:34:53 INFO - TinderboxPrint: CPU usage
1.7% 10:34:53 INFO - TinderboxPrint: I/O read bytes / time
2,338,816 / 584 10:34:53 INFO - TinderboxPrint: I/O write bytes / time
818,397,184 / 950,524 10:34:53 INFO - TinderboxPrint: CPU idle
118.6 (51.6%) 10:34:53 INFO - TinderboxPrint: CPU system
4.0 (1.7%) 10:34:53 INFO - TinderboxPrint: CPU user
106.5 (46.4%) 10:34:53 INFO - TinderboxPrint: Swap in / out
0 / 0 10:34:53 INFO - install - Wall time: 109s; CPU: 100.0%; Read bytes: 0; Write bytes: 684142592; Read time: 0; Write time: 798904 10:34:53 INFO - stage-files - Wall time: 0s; CPU: Can't collect data; Read bytes: 0; Write bytes: 0; Read time: 0; Write time: 0 10:34:53 INFO - run-tests - Wall time: 122s; CPU: 2.0%; Read bytes: 2306048; Write bytes: 9777152; Read time: 560; Write time: 8876 10:34:53 INFO - Running post-run listener: _upload_blobber_files 10:34:53 INFO - Blob upload gear active. 10:34:53 INFO - Preparing to upload files from /builds/slave/test/build/blobber_upload_dir. 10:34:53 INFO - Files from /builds/slave/test/build/blobber_upload_dir are to be uploaded with branch at the following location(s): https://blobupload.elasticbeanstalk.com 10:34:53 INFO - Running command: ['/builds/slave/test/build/venv/bin/python', '/builds/slave/test/build/venv/bin/blobberc.py', '-u', 'https://blobupload.elasticbeanstalk.com', '-a', '/builds/slave/test/oauth.txt', '-b', 'autoland', '-d', '/builds/slave/test/build/blobber_upload_dir', '--output-manifest', '/builds/slave/test/build/uploaded_files.json'] 10:34:53 INFO - Copy/paste: /builds/slave/test/build/venv/bin/python /builds/slave/test/build/venv/bin/blobberc.py -u https://blobupload.elasticbeanstalk.com -a /builds/slave/test/oauth.txt -b autoland -d /builds/slave/test/build/blobber_upload_dir --output-manifest /builds/slave/test/build/uploaded_files.json 10:34:54 INFO - (blobuploader) - INFO - Open directory for files ... 10:34:54 INFO - (blobuploader) - INFO - Uploading /builds/slave/test/build/blobber_upload_dir/jsreftest_raw.log ... 10:34:54 INFO - (blobuploader) - INFO - Using https://blobupload.elasticbeanstalk.com 10:34:54 INFO - (blobuploader) - INFO - Uploading, attempt #1. 10:34:54 INFO - (blobuploader) - INFO - TinderboxPrint: jsreftest_raw.log: uploaded 10:34:54 INFO - (blobuploader) - INFO - Blobserver returned 202. File uploaded! 10:34:54 INFO - (blobuploader) - INFO - Done attempting. 10:34:54 INFO - (blobuploader) - INFO - Uploading /builds/slave/test/build/blobber_upload_dir/resource-usage.json ... 10:34:54 INFO - (blobuploader) - INFO - Using https://blobupload.elasticbeanstalk.com 10:34:54 INFO - (blobuploader) - INFO - Uploading, attempt #1. 10:34:56 INFO - (blobuploader) - INFO - TinderboxPrint: resource-usage.json: uploaded 10:34:56 INFO - (blobuploader) - INFO - Blobserver returned 202. File uploaded! 10:34:56 INFO - (blobuploader) - INFO - Done attempting. 10:34:56 INFO - (blobuploader) - INFO - Uploading /builds/slave/test/build/blobber_upload_dir/jsreftest_errorsummary.log ... 10:34:56 INFO - (blobuploader) - INFO - Using https://blobupload.elasticbeanstalk.com 10:34:56 INFO - (blobuploader) - INFO - Uploading, attempt #1. 10:34:56 INFO - (blobuploader) - INFO - TinderboxPrint: jsreftest_errorsummary.log: uploaded 10:34:56 INFO - (blobuploader) - INFO - Blobserver returned 202. File uploaded! 10:34:56 INFO - (blobuploader) - INFO - Done attempting. 10:34:56 INFO - (blobuploader) - INFO - Iteration through files over. 10:34:56 INFO - Return code: 0 10:34:56 INFO - rmtree: /builds/slave/test/build/uploaded_files.json 10:34:56 INFO - retry: Calling remove with args: ('/builds/slave/test/build/uploaded_files.json',), kwargs: {}, attempt #1 10:34:56 INFO - Setting buildbot property blobber_files to {"resource-usage.json": "http://mozilla-releng-blobs.s3.amazonaws.com/blobs/autoland/sha512/b68d991affc8426246bbd290861010d955177f98d493b542dce325d722ce7ecbcc4ca47cafaba174218d4316db92ab3aec2bde1b1aa5f01472fb535f4a4303d5", "jsreftest_raw.log": "http://mozilla-releng-blobs.s3.amazonaws.com/blobs/autoland/sha512/ca8a7471232f066a9f8b97caf30d9ab02a044692a270ede44aec793bee88acbac5cad38be5b212b102b049f034e62f92c0b0275d4972549a63f75269b9b05e19", "jsreftest_errorsummary.log": "http://mozilla-releng-blobs.s3.amazonaws.com/blobs/autoland/sha512/a93b2e22c5e770f065cfa190afc0cd40b23f8326cddd98653197544a2df96438bd2f4eb75b629b334bbb3a41a82a5539a37d56220ecd25cdc2e759bd0959abc4"} 10:34:56 INFO - Writing buildbot properties ['blobber_files'] to /builds/slave/test/properties/blobber_files 10:34:56 INFO - Writing to file /builds/slave/test/properties/blobber_files 10:34:56 INFO - Contents: 10:34:56 INFO - blobber_files:{"resource-usage.json": "http://mozilla-releng-blobs.s3.amazonaws.com/blobs/autoland/sha512/b68d991affc8426246bbd290861010d955177f98d493b542dce325d722ce7ecbcc4ca47cafaba174218d4316db92ab3aec2bde1b1aa5f01472fb535f4a4303d5", "jsreftest_raw.log": "http://mozilla-releng-blobs.s3.amazonaws.com/blobs/autoland/sha512/ca8a7471232f066a9f8b97caf30d9ab02a044692a270ede44aec793bee88acbac5cad38be5b212b102b049f034e62f92c0b0275d4972549a63f75269b9b05e19", "jsreftest_errorsummary.log": "http://mozilla-releng-blobs.s3.amazonaws.com/blobs/autoland/sha512/a93b2e22c5e770f065cfa190afc0cd40b23f8326cddd98653197544a2df96438bd2f4eb75b629b334bbb3a41a82a5539a37d56220ecd25cdc2e759bd0959abc4"} 10:34:56 INFO - Running post-run listener: copy_logs_to_upload_dir 10:34:56 INFO - Copying logs to upload dir... 10:34:56 INFO - mkdir: /builds/slave/test/build/upload/logs 10:34:56 INFO - Copying logs to upload dir... 10:34:56 WARNING - returning nonzero exit status 2 program finished with exit code 2 elapsedTime=401.778540 ========= master_lag: 0.04 ========= ========= Finished '/tools/buildbot/bin/python scripts/scripts/desktop_unittest.py ...' failed (results: 2, elapsed: 6 mins, 41 secs) (at 2016-08-03 10:34:56.747644) ========= ========= Started set props: build_url blobber_files (results: 0, elapsed: 0 secs) (at 2016-08-03 10:34:56.748477) ========= bash -c 'for file in `ls -1`; do cat $file; done' in dir /builds/slave/test/properties (timeout 1200 secs) watching logfiles {} argv: ['bash', '-c', 'for file in `ls -1`; do cat $file; done'] environment: HOME=/home/cltbld LANG=en_US.UTF-8 LOGNAME=cltbld MAIL=/var/mail/cltbld NODE_PATH=/usr/lib/nodejs:/usr/lib/node_modules:/usr/share/javascript PATH=/usr/local/bin:/usr/local/bin:/usr/bin:/bin:/usr/local/games:/usr/games PWD=/builds/slave/test/properties SHELL=/bin/bash SHLVL=1 TERM=linux TMOUT=86400 USER=cltbld XDG_SESSION_COOKIE=9ca12473fbb1d023794ffd180000023c-1470245005.707928-777100845 _=/tools/buildbot/bin/python using PTY: False blobber_files:{"resource-usage.json": "http://mozilla-releng-blobs.s3.amazonaws.com/blobs/autoland/sha512/b68d991affc8426246bbd290861010d955177f98d493b542dce325d722ce7ecbcc4ca47cafaba174218d4316db92ab3aec2bde1b1aa5f01472fb535f4a4303d5", "jsreftest_raw.log": "http://mozilla-releng-blobs.s3.amazonaws.com/blobs/autoland/sha512/ca8a7471232f066a9f8b97caf30d9ab02a044692a270ede44aec793bee88acbac5cad38be5b212b102b049f034e62f92c0b0275d4972549a63f75269b9b05e19", "jsreftest_errorsummary.log": "http://mozilla-releng-blobs.s3.amazonaws.com/blobs/autoland/sha512/a93b2e22c5e770f065cfa190afc0cd40b23f8326cddd98653197544a2df96438bd2f4eb75b629b334bbb3a41a82a5539a37d56220ecd25cdc2e759bd0959abc4"} build_url:https://queue.taskcluster.net/v1/task/K3PRIIzlTx60gLnmQg3gVg/artifacts/public/build/firefox-51.0a1.en-US.linux-x86_64-asan.tar.bz2 program finished with exit code 0 elapsedTime=0.033468 build_url: 'https://queue.taskcluster.net/v1/task/K3PRIIzlTx60gLnmQg3gVg/artifacts/public/build/firefox-51.0a1.en-US.linux-x86_64-asan.tar.bz2' blobber_files: '{"resource-usage.json": "http://mozilla-releng-blobs.s3.amazonaws.com/blobs/autoland/sha512/b68d991affc8426246bbd290861010d955177f98d493b542dce325d722ce7ecbcc4ca47cafaba174218d4316db92ab3aec2bde1b1aa5f01472fb535f4a4303d5", "jsreftest_raw.log": "http://mozilla-releng-blobs.s3.amazonaws.com/blobs/autoland/sha512/ca8a7471232f066a9f8b97caf30d9ab02a044692a270ede44aec793bee88acbac5cad38be5b212b102b049f034e62f92c0b0275d4972549a63f75269b9b05e19", "jsreftest_errorsummary.log": "http://mozilla-releng-blobs.s3.amazonaws.com/blobs/autoland/sha512/a93b2e22c5e770f065cfa190afc0cd40b23f8326cddd98653197544a2df96438bd2f4eb75b629b334bbb3a41a82a5539a37d56220ecd25cdc2e759bd0959abc4"}' ========= master_lag: 0.03 ========= ========= Finished set props: build_url blobber_files (results: 0, elapsed: 0 secs) (at 2016-08-03 10:34:56.815745) ========= ========= Started 'rm -f ...' (results: 0, elapsed: 0 secs) (at 2016-08-03 10:34:56.816062) ========= rm -f oauth.txt in dir /builds/slave/test/. (timeout 1200 secs) watching logfiles {} argv: ['rm', '-f', 'oauth.txt'] environment: HOME=/home/cltbld LANG=en_US.UTF-8 LOGNAME=cltbld MAIL=/var/mail/cltbld NODE_PATH=/usr/lib/nodejs:/usr/lib/node_modules:/usr/share/javascript PATH=/usr/local/bin:/usr/local/bin:/usr/bin:/bin:/usr/local/games:/usr/games PWD=/builds/slave/test SHELL=/bin/bash SHLVL=1 TERM=linux TMOUT=86400 USER=cltbld XDG_SESSION_COOKIE=9ca12473fbb1d023794ffd180000023c-1470245005.707928-777100845 _=/tools/buildbot/bin/python using PTY: False program finished with exit code 0 elapsedTime=0.021224 ========= master_lag: 0.08 ========= ========= Finished 'rm -f ...' (results: 0, elapsed: 0 secs) (at 2016-08-03 10:34:56.914161) ========= ========= Started reboot skipped (results: 3, elapsed: 0 secs) (at 2016-08-03 10:34:56.914435) ========= ========= Finished reboot skipped (results: 3, elapsed: 0 secs) (at 2016-08-03 10:34:56.914805) ========= ========= Total master_lag: 0.71 =========