builder: mozilla-aurora_xp_ix-debug_test-marionette slave: t-xp32-ix-022 starttime: 1482423673.88 results: failure (2) buildid: 20161222065253 builduid: 312821edbfa04af3ab3dd3d065421b0c revision: 2805e2b6c22f55a9155a9f55ede9caa53508bdff ========= Started set props: master (results: 0, elapsed: 0 secs) (at 2016-12-22 08:21:13.880382) ========= master: http://buildbot-master112.bb.releng.scl3.mozilla.com:8201/ ========= Finished set props: master (results: 0, elapsed: 0 secs) (at 2016-12-22 08:21:13.881153) ========= ========= Started downloading to buildprops.json (results: 0, elapsed: 0 secs) (at 2016-12-22 08:21:13.881433) ========= ========= Finished downloading to buildprops.json (results: 0, elapsed: 0 secs) (at 2016-12-22 08:21:13.964764) ========= ========= Started 'bash -c ...' (results: 0, elapsed: 0 secs) (at 2016-12-22 08:21:13.965111) ========= 'bash' '-c' 'wget -Oarchiver_client.py --no-check-certificate --tries=10 --waitretry=3 https://hg.mozilla.org/build/tools/raw-file/default/buildfarm/utils/archiver_client.py' in dir C:\slave\test\. (timeout 1200 secs) watching logfiles {} argv: ['bash', '-c', 'wget -Oarchiver_client.py --no-check-certificate --tries=10 --waitretry=3 https://hg.mozilla.org/build/tools/raw-file/default/buildfarm/utils/archiver_client.py'] environment: ALLUSERSPROFILE=C:\Documents and Settings\All Users APPDATA=C:\Documents and Settings\cltbld.T-XP32-IX-022\Application Data COMMONPROGRAMFILES=C:\Program Files\Common Files COMPUTERNAME=T-XP32-IX-022 COMSPEC=C:\WINDOWS\system32\cmd.exe DCLOCATION=SCL3 DNSSUFFIX=wintest.releng.scl3.mozilla.com FP_NO_HOST_CHECK=NO HOMEDRIVE=C: HOMEPATH=\Documents and Settings\cltbld.T-XP32-IX-022 KTS_HOME=C:\Program Files\KTS KTS_VERSION=1.19c LOGONSERVER=\\T-XP32-IX-022 MONDIR=C:\Monitor_config\ MOZBUILDDIR=C:\mozilla-build\ NUMBER_OF_PROCESSORS=8 OS=Windows_NT OURDRIVE=C: PATH=C:\Program Files\NVIDIA Corporation\PhysX\Common;C:\WINDOWS\system32;C:\WINDOWS;C:\WINDOWS\System32\Wbem;C:\WINDOWS\system32\WindowsPowerShell\v1.0;C:\mozilla-build\python27;C:\mozilla-build\python27\Scripts;C:\mozilla-build\msys\bin;C:\mozilla-build\vim\vim72;C:\mozilla-build\wget;C:\mozilla-build\info-zip;C:\CoreUtils\bin;C:\mozilla-build\buildbotve\scripts;C:\mozilla-build\hg PATHEXT=.COM;.EXE;.BAT;.CMD;.VBS;.VBE;.JS;.JSE;.WSF;.WSH;.PSC1 PROCESSOR_ARCHITECTURE=x86 PROCESSOR_IDENTIFIER=x86 Family 6 Model 30 Stepping 5, GenuineIntel PROCESSOR_LEVEL=6 PROCESSOR_REVISION=1e05 PROGRAMFILES=C:\Program Files PROMPT=$P$G PWD=C:\slave\test RUNLOGFILE=C:\slave\\runslave.log SESSIONNAME=Console SLAVEDIR=C:\slave\ SYSTEMDRIVE=C: SYSTEMROOT=C:\WINDOWS TEMP=C:\DOCUME~1\CLTBLD~1.T-X\LOCALS~1\Temp TEST1=testie TMP=C:\DOCUME~1\CLTBLD~1.T-X\LOCALS~1\Temp USERDOMAIN=T-XP32-IX-022 USERNAME=cltbld USERPROFILE=C:\Documents and Settings\cltbld.T-XP32-IX-022 WINDIR=C:\WINDOWS using PTY: False --08:21:14-- https://hg.mozilla.org/build/tools/raw-file/default/buildfarm/utils/archiver_client.py => `archiver_client.py' Resolving hg.mozilla.org... 63.245.215.25, 63.245.215.102 Connecting to hg.mozilla.org|63.245.215.25|:443... connected. WARNING: Certificate verification error for hg.mozilla.org: certificate signature failure HTTP request sent, awaiting response... 200 Script output follows Length: 12,179 (12K) [text/x-python] 0K .......... . 100% 19.14 MB/s 08:21:14 (19.14 MB/s) - `archiver_client.py' saved [12179/12179] program finished with exit code 0 elapsedTime=0.562000 ========= master_lag: 0.01 ========= ========= Finished 'bash -c ...' (results: 0, elapsed: 0 secs) (at 2016-12-22 08:21:14.538934) ========= ========= Started 'rm -rf ...' (results: 0, elapsed: 0 secs) (at 2016-12-22 08:21:14.539263) ========= 'rm' '-rf' 'scripts' 'properties' in dir C:\slave\test\. (timeout 1200 secs) watching logfiles {} argv: ['rm', '-rf', 'scripts', 'properties'] environment: ALLUSERSPROFILE=C:\Documents and Settings\All Users APPDATA=C:\Documents and Settings\cltbld.T-XP32-IX-022\Application Data COMMONPROGRAMFILES=C:\Program Files\Common Files COMPUTERNAME=T-XP32-IX-022 COMSPEC=C:\WINDOWS\system32\cmd.exe DCLOCATION=SCL3 DNSSUFFIX=wintest.releng.scl3.mozilla.com FP_NO_HOST_CHECK=NO HOMEDRIVE=C: HOMEPATH=\Documents and Settings\cltbld.T-XP32-IX-022 KTS_HOME=C:\Program Files\KTS KTS_VERSION=1.19c LOGONSERVER=\\T-XP32-IX-022 MONDIR=C:\Monitor_config\ MOZBUILDDIR=C:\mozilla-build\ NUMBER_OF_PROCESSORS=8 OS=Windows_NT OURDRIVE=C: PATH=C:\Program Files\NVIDIA Corporation\PhysX\Common;C:\WINDOWS\system32;C:\WINDOWS;C:\WINDOWS\System32\Wbem;C:\WINDOWS\system32\WindowsPowerShell\v1.0;C:\mozilla-build\python27;C:\mozilla-build\python27\Scripts;C:\mozilla-build\msys\bin;C:\mozilla-build\vim\vim72;C:\mozilla-build\wget;C:\mozilla-build\info-zip;C:\CoreUtils\bin;C:\mozilla-build\buildbotve\scripts;C:\mozilla-build\hg PATHEXT=.COM;.EXE;.BAT;.CMD;.VBS;.VBE;.JS;.JSE;.WSF;.WSH;.PSC1 PROCESSOR_ARCHITECTURE=x86 PROCESSOR_IDENTIFIER=x86 Family 6 Model 30 Stepping 5, GenuineIntel PROCESSOR_LEVEL=6 PROCESSOR_REVISION=1e05 PROGRAMFILES=C:\Program Files PROMPT=$P$G PWD=C:\slave\test RUNLOGFILE=C:\slave\\runslave.log SESSIONNAME=Console SLAVEDIR=C:\slave\ SYSTEMDRIVE=C: SYSTEMROOT=C:\WINDOWS TEMP=C:\DOCUME~1\CLTBLD~1.T-X\LOCALS~1\Temp TEST1=testie TMP=C:\DOCUME~1\CLTBLD~1.T-X\LOCALS~1\Temp USERDOMAIN=T-XP32-IX-022 USERNAME=cltbld USERPROFILE=C:\Documents and Settings\cltbld.T-XP32-IX-022 WINDIR=C:\WINDOWS using PTY: False program finished with exit code 0 elapsedTime=0.656000 ========= master_lag: 0.00 ========= ========= Finished 'rm -rf ...' (results: 0, elapsed: 0 secs) (at 2016-12-22 08:21:15.198901) ========= ========= Started 'bash -c ...' (results: 0, elapsed: 1 secs) (at 2016-12-22 08:21:15.199261) ========= 'bash' '-c' u'python archiver_client.py mozharness --repo releases/mozilla-aurora --rev 2805e2b6c22f55a9155a9f55ede9caa53508bdff --destination scripts --debug' in dir C:\slave\test\. (timeout 1200 secs) watching logfiles {} argv: ['bash', '-c', u'python archiver_client.py mozharness --repo releases/mozilla-aurora --rev 2805e2b6c22f55a9155a9f55ede9caa53508bdff --destination scripts --debug'] environment: ALLUSERSPROFILE=C:\Documents and Settings\All Users APPDATA=C:\Documents and Settings\cltbld.T-XP32-IX-022\Application Data COMMONPROGRAMFILES=C:\Program Files\Common Files COMPUTERNAME=T-XP32-IX-022 COMSPEC=C:\WINDOWS\system32\cmd.exe DCLOCATION=SCL3 DNSSUFFIX=wintest.releng.scl3.mozilla.com FP_NO_HOST_CHECK=NO HOMEDRIVE=C: HOMEPATH=\Documents and Settings\cltbld.T-XP32-IX-022 KTS_HOME=C:\Program Files\KTS KTS_VERSION=1.19c LOGONSERVER=\\T-XP32-IX-022 MONDIR=C:\Monitor_config\ MOZBUILDDIR=C:\mozilla-build\ NUMBER_OF_PROCESSORS=8 OS=Windows_NT OURDRIVE=C: PATH=C:\Program Files\NVIDIA Corporation\PhysX\Common;C:\WINDOWS\system32;C:\WINDOWS;C:\WINDOWS\System32\Wbem;C:\WINDOWS\system32\WindowsPowerShell\v1.0;C:\mozilla-build\python27;C:\mozilla-build\python27\Scripts;C:\mozilla-build\msys\bin;C:\mozilla-build\vim\vim72;C:\mozilla-build\wget;C:\mozilla-build\info-zip;C:\CoreUtils\bin;C:\mozilla-build\buildbotve\scripts;C:\mozilla-build\hg PATHEXT=.COM;.EXE;.BAT;.CMD;.VBS;.VBE;.JS;.JSE;.WSF;.WSH;.PSC1 PROCESSOR_ARCHITECTURE=x86 PROCESSOR_IDENTIFIER=x86 Family 6 Model 30 Stepping 5, GenuineIntel PROCESSOR_LEVEL=6 PROCESSOR_REVISION=1e05 PROGRAMFILES=C:\Program Files PROMPT=$P$G PWD=C:\slave\test RUNLOGFILE=C:\slave\\runslave.log SESSIONNAME=Console SLAVEDIR=C:\slave\ SYSTEMDRIVE=C: SYSTEMROOT=C:\WINDOWS TEMP=C:\DOCUME~1\CLTBLD~1.T-X\LOCALS~1\Temp TEST1=testie TMP=C:\DOCUME~1\CLTBLD~1.T-X\LOCALS~1\Temp USERDOMAIN=T-XP32-IX-022 USERNAME=cltbld USERPROFILE=C:\Documents and Settings\cltbld.T-XP32-IX-022 WINDIR=C:\WINDOWS using PTY: False 2016-12-22 08:21:15,585 truncating revision to first 12 chars 2016-12-22 08:21:15,585 Setting DEBUG logging. 2016-12-22 08:21:15,585 attempt 1/10 2016-12-22 08:21:15,585 Getting archive location from https://api.pub.build.mozilla.org/archiver/hgmo/releases/mozilla-aurora/2805e2b6c22f?&preferred_region=us-west-2&suffix=tar.gz&subdir=testing/mozharness 2016-12-22 08:21:15,976 unpacking tar archive at: mozilla-aurora-2805e2b6c22f/testing/mozharness/ 2016-12-22 08:21:16,085 skipping symlink on windows: configs/single_locale/linux32.py program finished with exit code 0 elapsedTime=1.172000 ========= master_lag: 0.04 ========= ========= Finished 'bash -c ...' (results: 0, elapsed: 1 secs) (at 2016-12-22 08:21:16.413311) ========= ========= Started set props: script_repo_revision (results: 0, elapsed: 0 secs) (at 2016-12-22 08:21:16.413595) ========= script_repo_revision: 2805e2b6c22f55a9155a9f55ede9caa53508bdff ========= Finished set props: script_repo_revision (results: 0, elapsed: 0 secs) (at 2016-12-22 08:21:16.413973) ========= ========= Started downloading to oauth.txt (results: 0, elapsed: 0 secs) (at 2016-12-22 08:21:16.414254) ========= ========= Finished downloading to oauth.txt (results: 0, elapsed: 0 secs) (at 2016-12-22 08:21:16.423573) ========= ========= Started 'c:/mozilla-build/python27/python -u ...' failed (results: 2, elapsed: 4 mins, 4 secs) (at 2016-12-22 08:21:16.423855) ========= 'c:/mozilla-build/python27/python' '-u' 'scripts/scripts/marionette.py' '--cfg' 'marionette/windows_config.py' '--blob-upload-branch' 'mozilla-aurora' in dir C:\slave\test\. (timeout 1800 secs) (maxTime 7200 secs) watching logfiles {} argv: ['c:/mozilla-build/python27/python', '-u', 'scripts/scripts/marionette.py', '--cfg', 'marionette/windows_config.py', '--blob-upload-branch', 'mozilla-aurora'] environment: ALLUSERSPROFILE=C:\Documents and Settings\All Users APPDATA=C:\Documents and Settings\cltbld.T-XP32-IX-022\Application Data COMMONPROGRAMFILES=C:\Program Files\Common Files COMPUTERNAME=T-XP32-IX-022 COMSPEC=C:\WINDOWS\system32\cmd.exe DCLOCATION=SCL3 DNSSUFFIX=wintest.releng.scl3.mozilla.com DevEnvDir=D:\msvs8\Common7\IDE FP_NO_HOST_CHECK=NO FrameworkDir=C:\WINDOWS\Microsoft.NET\Framework FrameworkSDKDir=D:\msvs8\SDK\v2.0 FrameworkVersion=v2.0.50727 HOMEDRIVE=C: HOMEPATH=\Documents and Settings\cltbld.T-XP32-IX-022 KTS_HOME=C:\Program Files\KTS KTS_VERSION=1.19c LIBPATH=C:\WINDOWS\Microsoft.NET\Framework\v2.0.50727;D:\msvs8\VC\ATLMFC\LIB LOGONSERVER=\\T-XP32-IX-022 MONDIR=C:\Monitor_config\ MOZBUILDDIR=C:\mozilla-build\ MOZILLABUILD=D:\mozilla-build MOZILLABUILDDRIVE=C: MOZILLABUILDPATH=\mozilla-build\ MOZ_AIRBAG=1 MOZ_CRASHREPORTER_NO_REPORT=1 MOZ_HIDE_RESULTS_TABLE=1 MOZ_MSVCVERSION=8 MOZ_NO_REMOTE=1 MOZ_TOOLS=D:\mozilla-build\moztools MSVCDir=D:\msvs8\VC NO_EM_RESTART=1 NO_FAIL_ON_TEST_ERRORS=1 NUMBER_OF_PROCESSORS=8 OS=Windows_NT OURDRIVE=C: PATH=C:\Program Files\NVIDIA Corporation\PhysX\Common;C:\WINDOWS\system32;C:\WINDOWS;C:\WINDOWS\System32\Wbem;C:\WINDOWS\system32\WindowsPowerShell\v1.0;C:\mozilla-build\python27;C:\mozilla-build\python27\Scripts;C:\mozilla-build\msys\bin;C:\mozilla-build\vim\vim72;C:\mozilla-build\wget;C:\mozilla-build\info-zip;C:\CoreUtils\bin;C:\mozilla-build\buildbotve\scripts;C:\mozilla-build\hg PATHEXT=.COM;.EXE;.BAT;.CMD;.VBS;.VBE;.JS;.JSE;.WSF;.WSH;.PSC1 PROCESSOR_ARCHITECTURE=x86 PROCESSOR_IDENTIFIER=x86 Family 6 Model 30 Stepping 5, GenuineIntel PROCESSOR_LEVEL=6 PROCESSOR_REVISION=1e05 PROGRAMFILES=C:\Program Files PROMPT=$P$G PROPERTIES_FILE=C:\slave\test/buildprops.json PWD=C:\slave\test RUNLOGFILE=C:\slave\\runslave.log SESSIONNAME=Console SLAVEDIR=C:\slave\ SYSTEMDRIVE=C: SYSTEMROOT=C:\WINDOWS TEMP=C:\DOCUME~1\CLTBLD~1.T-X\LOCALS~1\Temp TEST1=testie TMP=C:\DOCUME~1\CLTBLD~1.T-X\LOCALS~1\Temp USERDOMAIN=T-XP32-IX-022 USERNAME=cltbld USERPROFILE=C:\Documents and Settings\cltbld.T-XP32-IX-022 VCINSTALLDIR=D:\msvs8\VC VCVARS=D:\msvs8\VC\bin\vcvars32.bat VSINSTALLDIR=D:\msvs8 WINDIR=C:\WINDOWS XPCOM_DEBUG_BREAK=warn using PTY: False 08:21:16 INFO - MultiFileLogger online at 20161222 08:21:16 in C:\slave\test 08:21:16 INFO - Run as scripts/scripts/marionette.py --cfg marionette/windows_config.py --blob-upload-branch mozilla-aurora 08:21:16 INFO - Dumping config to C:\slave\test\logs\localconfig.json. 08:21:17 INFO - {'allow_software_gl_layers': False, 08:21:17 INFO - 'append_to_log': False, 08:21:17 INFO - 'base_work_dir': 'C:\\slave\\test', 08:21:17 INFO - 'blob_upload_branch': 'mozilla-aurora', 08:21:17 INFO - 'blob_uploader_auth_file': 'C:\\slave\\test\\oauth.txt', 08:21:17 INFO - 'buildbot_json_path': 'buildprops.json', 08:21:17 INFO - 'config_files': ('marionette/windows_config.py',), 08:21:17 INFO - 'default_actions': ('clobber', 08:21:17 INFO - 'read-buildbot-config', 08:21:17 INFO - 'download-and-extract', 08:21:17 INFO - 'create-virtualenv', 08:21:17 INFO - 'install', 08:21:17 INFO - 'run-tests'), 08:21:17 INFO - 'default_blob_upload_servers': ('https://blobupload.elasticbeanstalk.com',), 08:21:17 INFO - 'download_minidump_stackwalk': True, 08:21:17 INFO - 'download_symbols': 'ondemand', 08:21:17 INFO - 'e10s': False, 08:21:17 INFO - 'exes': {'hg': 'c:/mozilla-build/hg/hg', 08:21:17 INFO - 'mozinstall': ('C:\\slave\\test/build/venv/scripts/python', 08:21:17 INFO - 'C:\\slave\\test/build/venv/scripts/mozinstall-script.py'), 08:21:17 INFO - 'python': 'c:/mozilla-build/python27/python', 08:21:17 INFO - 'tooltool.py': ('c:\\mozilla-build\\python27\\python.exe', 08:21:17 INFO - 'C:/mozilla-build/tooltool.py'), 08:21:17 INFO - 'virtualenv': ('c:/mozilla-build/python27/python', 08:21:17 INFO - 'c:/mozilla-build/buildbotve/virtualenv.py')}, 08:21:17 INFO - 'find_links': ('http://pypi.pvt.build.mozilla.org/pub', 08:21:17 INFO - 'http://pypi.pub.build.mozilla.org/pub'), 08:21:17 INFO - 'log_level': 'info', 08:21:17 INFO - 'log_to_console': True, 08:21:17 INFO - 'marionette_address': 'localhost:2828', 08:21:17 INFO - 'opt_config_files': (), 08:21:17 INFO - 'pip_index': False, 08:21:17 INFO - 'require_test_zip': True, 08:21:17 INFO - 'suite_definitions': {'marionette_desktop': {'options': ('--log-raw=%(raw_log_file)s', 08:21:17 INFO - '--log-errorsummary=%(error_summary_file)s', 08:21:17 INFO - '--log-html=%(html_report_file)s', 08:21:17 INFO - '--binary=%(binary)s', 08:21:17 INFO - '--address=%(address)s', 08:21:17 INFO - '--symbols-path=%(symbols_path)s'), 08:21:17 INFO - 'run_filename': '', 08:21:17 INFO - 'testsdir': ''}}, 08:21:17 INFO - 'test_manifest': 'unit-tests.ini', 08:21:17 INFO - 'virtualenv_path': 'venv', 08:21:17 INFO - 'virtualenv_python_dll': 'c:/mozilla-build/python27/python27.dll', 08:21:17 INFO - 'volatile_config': {'actions': None, 'add_actions': None, 'no_actions': None}, 08:21:17 INFO - 'work_dir': 'build'} 08:21:17 INFO - [mozharness: 2016-12-22 16:21:17.023000Z] Running clobber step. 08:21:17 INFO - Running pre-action listener: _resource_record_pre_action 08:21:17 INFO - Running main action method: clobber 08:21:17 INFO - rmtree: C:\slave\test\build 08:21:17 INFO - Using _rmtree_windows ... 08:21:17 INFO - retry: Calling _rmtree_windows with args: ('C:\\slave\\test\\build',), kwargs: {}, attempt #1 08:21:37 INFO - Running post-action listener: _resource_record_post_action 08:21:37 INFO - [mozharness: 2016-12-22 16:21:37.351000Z] Finished clobber step (success) 08:21:37 INFO - [mozharness: 2016-12-22 16:21:37.351000Z] Running read-buildbot-config step. 08:21:37 INFO - Running pre-action listener: _resource_record_pre_action 08:21:37 INFO - Running main action method: read_buildbot_config 08:21:37 INFO - Using buildbot properties: 08:21:37 INFO - { 08:21:37 INFO - "project": "", 08:21:37 INFO - "product": "firefox", 08:21:37 INFO - "script_repo_revision": "production", 08:21:37 INFO - "scheduler": "tests-mozilla-aurora-xp_ix-debug-unittest", 08:21:37 INFO - "repository": "", 08:21:37 INFO - "buildername": "Windows XP 32-bit mozilla-aurora debug test marionette", 08:21:37 INFO - "buildid": "20161222065253", 08:21:37 INFO - "pgo_build": "False", 08:21:37 INFO - "basedir": "C:\\slave\\test", 08:21:37 INFO - "buildnumber": 48, 08:21:37 INFO - "slavename": "t-xp32-ix-022", 08:21:37 INFO - "revision": "2805e2b6c22f55a9155a9f55ede9caa53508bdff", 08:21:37 INFO - "master": "http://buildbot-master112.bb.releng.scl3.mozilla.com:8201/", 08:21:37 INFO - "platform": "win32", 08:21:37 INFO - "branch": "mozilla-aurora", 08:21:37 INFO - "repo_path": "releases/mozilla-aurora", 08:21:37 INFO - "moz_repo_path": "", 08:21:37 INFO - "stage_platform": "win32", 08:21:37 INFO - "builduid": "312821edbfa04af3ab3dd3d065421b0c", 08:21:37 INFO - "slavebuilddir": "test" 08:21:37 INFO - } 08:21:37 INFO - Found a test packages url https://queue.taskcluster.net/v1/task/VyPEbHbKTuCa6riT6uy3nQ/artifacts/public/build/firefox-52.0a2.en-US.win32.test_packages.json. 08:21:37 INFO - Found installer url https://queue.taskcluster.net/v1/task/VyPEbHbKTuCa6riT6uy3nQ/artifacts/public/build/firefox-52.0a2.en-US.win32.zip. 08:21:37 INFO - Running post-action listener: _resource_record_post_action 08:21:37 INFO - [mozharness: 2016-12-22 16:21:37.351000Z] Finished read-buildbot-config step (success) 08:21:37 INFO - [mozharness: 2016-12-22 16:21:37.351000Z] Skipping pull step. 08:21:37 INFO - [mozharness: 2016-12-22 16:21:37.351000Z] Running download-and-extract step. 08:21:37 INFO - Running pre-action listener: _resource_record_pre_action 08:21:37 INFO - Running main action method: download_and_extract 08:21:37 INFO - mkdir: C:\slave\test\build\tests 08:21:37 INFO - proxxy config: {'regions': ['.use1.', '.usw2.', '.scl3'], 'instances': ['proxxy1.srv.releng.use1.mozilla.com', 'proxxy1.srv.releng.usw2.mozilla.com', 'proxxy1.srv.releng.scl3.mozilla.com'], 'urls': [('http://ftp.mozilla.org', 'ftp.mozilla.org'), ('https://ftp.mozilla.org', 'ftp.mozilla.org'), ('https://ftp-ssl.mozilla.org', 'ftp.mozilla.org'), ('http://pypi.pvt.build.mozilla.org', 'pypi.pvt.build.mozilla.org'), ('http://pypi.pub.build.mozilla.org', 'pypi.pub.build.mozilla.org')]} 08:21:37 INFO - trying https://queue.taskcluster.net/v1/task/VyPEbHbKTuCa6riT6uy3nQ/artifacts/public/build/firefox-52.0a2.en-US.win32.test_packages.json 08:21:37 INFO - Downloading https://queue.taskcluster.net/v1/task/VyPEbHbKTuCa6riT6uy3nQ/artifacts/public/build/firefox-52.0a2.en-US.win32.test_packages.json to C:\slave\test\build\firefox-52.0a2.en-US.win32.test_packages.json 08:21:37 INFO - retry: Calling _download_file with args: (), kwargs: {'url': 'https://queue.taskcluster.net/v1/task/VyPEbHbKTuCa6riT6uy3nQ/artifacts/public/build/firefox-52.0a2.en-US.win32.test_packages.json', 'file_name': 'C:\\slave\\test\\build\\firefox-52.0a2.en-US.win32.test_packages.json'}, attempt #1 08:21:38 INFO - Downloaded 1274 bytes. 08:21:38 INFO - Reading from file C:\slave\test\build\firefox-52.0a2.en-US.win32.test_packages.json 08:21:38 INFO - Using the following test package requirements: 08:21:38 INFO - {u'common': [u'firefox-52.0a2.en-US.win32.common.tests.zip'], 08:21:38 INFO - u'cppunittest': [u'firefox-52.0a2.en-US.win32.common.tests.zip', 08:21:38 INFO - u'firefox-52.0a2.en-US.win32.cppunittest.tests.zip'], 08:21:38 INFO - u'gtest': [u'firefox-52.0a2.en-US.win32.common.tests.zip', 08:21:38 INFO - u'firefox-52.0a2.en-US.win32.gtest.tests.zip'], 08:21:38 INFO - u'jittest': [u'firefox-52.0a2.en-US.win32.common.tests.zip', 08:21:38 INFO - u'jsshell-win32.zip'], 08:21:38 INFO - u'mochitest': [u'firefox-52.0a2.en-US.win32.common.tests.zip', 08:21:38 INFO - u'firefox-52.0a2.en-US.win32.mochitest.tests.zip'], 08:21:38 INFO - u'mozbase': [u'firefox-52.0a2.en-US.win32.common.tests.zip'], 08:21:38 INFO - u'reftest': [u'firefox-52.0a2.en-US.win32.common.tests.zip', 08:21:38 INFO - u'firefox-52.0a2.en-US.win32.reftest.tests.zip'], 08:21:38 INFO - u'talos': [u'firefox-52.0a2.en-US.win32.common.tests.zip', 08:21:38 INFO - u'firefox-52.0a2.en-US.win32.talos.tests.zip'], 08:21:38 INFO - u'web-platform': [u'firefox-52.0a2.en-US.win32.common.tests.zip', 08:21:38 INFO - u'firefox-52.0a2.en-US.win32.web-platform.tests.zip'], 08:21:38 INFO - u'xpcshell': [u'firefox-52.0a2.en-US.win32.common.tests.zip', 08:21:38 INFO - u'firefox-52.0a2.en-US.win32.xpcshell.tests.zip']} 08:21:38 INFO - Downloading packages: [u'firefox-52.0a2.en-US.win32.common.tests.zip'] for test suite category: common 08:21:38 INFO - Downloading and extracting to C:\slave\test\build\tests these dirs * from https://queue.taskcluster.net/v1/task/VyPEbHbKTuCa6riT6uy3nQ/artifacts/public/build/firefox-52.0a2.en-US.win32.common.tests.zip 08:21:38 INFO - retry: Calling fetch_url_into_memory with args: (), kwargs: {'url': u'https://queue.taskcluster.net/v1/task/VyPEbHbKTuCa6riT6uy3nQ/artifacts/public/build/firefox-52.0a2.en-US.win32.common.tests.zip'}, attempt #1 08:21:38 INFO - Fetch https://queue.taskcluster.net/v1/task/VyPEbHbKTuCa6riT6uy3nQ/artifacts/public/build/firefox-52.0a2.en-US.win32.common.tests.zip into memory 08:21:38 INFO - Http code: 200 08:21:38 INFO - via: 1.1 1b52a5dd431f9e3c81753e61dfdf467a.cloudfront.net (CloudFront) 08:21:38 INFO - x-amz-cf-id: rCUTsrZCHmibg-5BeK6YuIj_EHEy9e4DNMJ3EV2a8hOiW5if1PMUeA== 08:21:38 INFO - x-amz-version-id: zETn.bHSB6xTHrNZDjMwjrPPtmpSXKTS 08:21:39 INFO - Expected file size: 18646756 08:21:39 INFO - Obtained file size: 18646756 08:22:11 INFO - proxxy config: {'regions': ['.use1.', '.usw2.', '.scl3'], 'instances': ['proxxy1.srv.releng.use1.mozilla.com', 'proxxy1.srv.releng.usw2.mozilla.com', 'proxxy1.srv.releng.scl3.mozilla.com'], 'urls': [('http://ftp.mozilla.org', 'ftp.mozilla.org'), ('https://ftp.mozilla.org', 'ftp.mozilla.org'), ('https://ftp-ssl.mozilla.org', 'ftp.mozilla.org'), ('http://pypi.pvt.build.mozilla.org', 'pypi.pvt.build.mozilla.org'), ('http://pypi.pub.build.mozilla.org', 'pypi.pub.build.mozilla.org')]} 08:22:11 INFO - trying https://queue.taskcluster.net/v1/task/VyPEbHbKTuCa6riT6uy3nQ/artifacts/public/build/firefox-52.0a2.en-US.win32.zip 08:22:11 INFO - Downloading https://queue.taskcluster.net/v1/task/VyPEbHbKTuCa6riT6uy3nQ/artifacts/public/build/firefox-52.0a2.en-US.win32.zip to C:\slave\test\build\firefox-52.0a2.en-US.win32.zip 08:22:11 INFO - retry: Calling _download_file with args: (), kwargs: {'url': 'https://queue.taskcluster.net/v1/task/VyPEbHbKTuCa6riT6uy3nQ/artifacts/public/build/firefox-52.0a2.en-US.win32.zip', 'file_name': 'C:\\slave\\test\\build\\firefox-52.0a2.en-US.win32.zip'}, attempt #1 08:22:17 INFO - Downloaded 68829913 bytes. 08:22:17 INFO - Setting buildbot property build_url to https://queue.taskcluster.net/v1/task/VyPEbHbKTuCa6riT6uy3nQ/artifacts/public/build/firefox-52.0a2.en-US.win32.zip 08:22:17 INFO - mkdir: C:\slave\test\properties 08:22:17 INFO - Writing buildbot properties ['build_url'] to C:\slave\test\properties\build_url 08:22:17 INFO - Writing to file C:\slave\test\properties\build_url 08:22:17 INFO - Contents: 08:22:17 INFO - build_url:https://queue.taskcluster.net/v1/task/VyPEbHbKTuCa6riT6uy3nQ/artifacts/public/build/firefox-52.0a2.en-US.win32.zip 08:22:17 INFO - Running post-action listener: _resource_record_post_action 08:22:17 INFO - Running post-action listener: set_extra_try_arguments 08:22:17 INFO - [mozharness: 2016-12-22 16:22:17.711000Z] Finished download-and-extract step (success) 08:22:17 INFO - [mozharness: 2016-12-22 16:22:17.711000Z] Running create-virtualenv step. 08:22:17 INFO - Running pre-action listener: _configure_marionette_virtualenv 08:22:17 INFO - Running pre-action listener: _resource_record_pre_action 08:22:17 INFO - Running main action method: create_virtualenv 08:22:17 INFO - Creating virtualenv C:\slave\test\build\venv 08:22:17 INFO - mkdir: C:\slave\test\build\venv\Scripts 08:22:17 INFO - Copying c:/mozilla-build/python27/python27.dll to C:\slave\test\build\venv\Scripts\python27.dll 08:22:17 WARNING - Can't copy c:/mozilla-build/python27/python27.dll to C:\slave\test\build\venv\Scripts\python27.dll: [Errno 2] No such file or directory: 'c:/mozilla-build/python27/python27.dll'! 08:22:17 INFO - Running command: ['c:/mozilla-build/python27/python', 'c:/mozilla-build/buildbotve/virtualenv.py', '--no-site-packages', '--distribute', 'C:\\slave\\test\\build\\venv'] in C:\slave\test\build 08:22:17 INFO - Copy/paste: c:/mozilla-build/python27/python c:/mozilla-build/buildbotve/virtualenv.py --no-site-packages --distribute C:\slave\test\build\venv 08:22:18 INFO - New python executable in C:\slave\test\build\venv\Scripts\python.exe 08:22:20 INFO - Installing distribute......................................................................................................................................................................................done. 08:22:20 INFO - Return code: 0 08:22:20 INFO - Getting output from command: ['C:\\slave\\test\\build\\venv\\Scripts\\pip', '--version'] 08:22:20 INFO - Copy/paste: C:\slave\test\build\venv\Scripts\pip --version 08:22:21 INFO - Reading from file tmpfile_stdout 08:22:21 INFO - Output received: 08:22:21 INFO - pip 0.8.2 from c:\slave\test\build\venv\lib\site-packages\pip-0.8.2-py2.7.egg (python 2.7) 08:22:21 INFO - Using _rmtree_windows ... 08:22:21 INFO - Using _rmtree_windows ... 08:22:21 INFO - Installing psutil>=3.1.1 into virtualenv C:\slave\test\build\venv 08:22:21 INFO - proxxy config: {'regions': ['.use1.', '.usw2.', '.scl3'], 'instances': ['proxxy1.srv.releng.use1.mozilla.com', 'proxxy1.srv.releng.usw2.mozilla.com', 'proxxy1.srv.releng.scl3.mozilla.com'], 'urls': [('http://ftp.mozilla.org', 'ftp.mozilla.org'), ('https://ftp.mozilla.org', 'ftp.mozilla.org'), ('https://ftp-ssl.mozilla.org', 'ftp.mozilla.org'), ('http://pypi.pvt.build.mozilla.org', 'pypi.pvt.build.mozilla.org'), ('http://pypi.pub.build.mozilla.org', 'pypi.pub.build.mozilla.org')]} 08:22:21 INFO - http://pypi.pvt.build.mozilla.org/pub matches http://pypi.pvt.build.mozilla.org 08:22:21 INFO - proxxy config: {'regions': ['.use1.', '.usw2.', '.scl3'], 'instances': ['proxxy1.srv.releng.use1.mozilla.com', 'proxxy1.srv.releng.usw2.mozilla.com', 'proxxy1.srv.releng.scl3.mozilla.com'], 'urls': [('http://ftp.mozilla.org', 'ftp.mozilla.org'), ('https://ftp.mozilla.org', 'ftp.mozilla.org'), ('https://ftp-ssl.mozilla.org', 'ftp.mozilla.org'), ('http://pypi.pvt.build.mozilla.org', 'pypi.pvt.build.mozilla.org'), ('http://pypi.pub.build.mozilla.org', 'pypi.pub.build.mozilla.org')]} 08:22:21 INFO - http://pypi.pub.build.mozilla.org/pub matches http://pypi.pub.build.mozilla.org 08:22:21 INFO - retry: Calling run_command with args: [['C:\\slave\\test\\build\\venv\\Scripts\\pip', 'install', '--timeout', '120', '--no-index', '--find-links', 'http://pypi.pvt.build.mozilla.org/pub', '--find-links', 'http://pypi.pub.build.mozilla.org/pub', 'psutil>=3.1.1']], kwargs: {'error_level': 'warning', 'error_list': [{'substr': 'not found or a compiler error:', 'level': 'warning'}, {'regex': <_sre.SRE_Pattern object at 0x00A4EE90>, 'level': 'error'}, {'regex': <_sre.SRE_Pattern object at 0x00ADEA70>, 'level': 'warning'}, {'regex': <_sre.SRE_Pattern object at 0x00C46F80>, 'level': 'debug'}, {'substr': 'command not found', 'level': 'error'}, {'regex': <_sre.SRE_Pattern object at 0x00B99368>, 'level': 'warning'}, {'substr': 'Traceback (most recent call last)', 'level': 'error'}, {'substr': 'SyntaxError: ', 'level': 'error'}, {'substr': 'TypeError: ', 'level': 'error'}, {'substr': 'NameError: ', 'level': 'error'}, {'substr': 'ZeroDivisionError: ', 'level': 'error'}, {'regex': <_sre.SRE_Pattern object at 0x00A7A700>, 'level': 'critical'}, {'regex': <_sre.SRE_Pattern object at 0x00B982A0>, 'level': 'critical'}], 'cwd': 'C:\\slave\\test\\build', 'env': {'TMP': 'C:\\DOCUME~1\\CLTBLD~1.T-X\\LOCALS~1\\Temp', 'MOZILLABUILD': 'D:\\mozilla-build', 'COMPUTERNAME': 'T-XP32-IX-022', 'USERDOMAIN': 'T-XP32-IX-022', 'KTS_VERSION': '1.19c', 'LIBPATH': 'C:\\WINDOWS\\Microsoft.NET\\Framework\\v2.0.50727;D:\\msvs8\\VC\\ATLMFC\\LIB', 'COMMONPROGRAMFILES': 'C:\\Program Files\\Common Files', 'MOZILLABUILDPATH': '\\mozilla-build\\', 'PROCESSOR_IDENTIFIER': 'x86 Family 6 Model 30 Stepping 5, GenuineIntel', 'PROGRAMFILES': 'C:\\Program Files', 'PROCESSOR_REVISION': '1e05', 'DNSSUFFIX': 'wintest.releng.scl3.mozilla.com', 'SYSTEMROOT': 'C:\\WINDOWS', 'NO_EM_RESTART': '1', 'OURDRIVE': 'C:', 'MSVCDIR': 'D:\\msvs8\\VC', 'XPCOM_DEBUG_BREAK': 'warn', 'MONDIR': 'C:\\Monitor_config\\', 'TEMP': 'C:\\DOCUME~1\\CLTBLD~1.T-X\\LOCALS~1\\Temp', 'COMSPEC': 'C:\\WINDOWS\\system32\\cmd.exe', 'RUNLOGFILE': 'C:\\slave\\\\runslave.log', 'PROCESSOR_ARCHITECTURE': 'x86', 'VCVARS': 'D:\\msvs8\\VC\\bin\\vcvars32.bat', 'VSINSTALLDIR': 'D:\\msvs8', 'ALLUSERSPROFILE': 'C:\\Documents and Settings\\All Users', 'MOZILLABUILDDRIVE': 'C:', 'SESSIONNAME': 'Console', 'HOMEPATH': '\\Documents and Settings\\cltbld.T-XP32-IX-022', 'FRAMEWORKDIR': 'C:\\WINDOWS\\Microsoft.NET\\Framework', 'MOZBUILDDIR': 'C:\\mozilla-build\\', 'FRAMEWORKSDKDIR': 'D:\\msvs8\\SDK\\v2.0', 'TEST1': 'testie', 'LOGONSERVER': '\\\\T-XP32-IX-022', 'MOZ_NO_REMOTE': '1', 'MOZ_HIDE_RESULTS_TABLE': '1', 'WINDIR': 'C:\\WINDOWS', 'MOZ_TOOLS': 'D:\\mozilla-build\\moztools', 'PATH': 'C:\\Program Files\\NVIDIA Corporation\\PhysX\\Common;C:\\WINDOWS\\system32;C:\\WINDOWS;C:\\WINDOWS\\System32\\Wbem;C:\\WINDOWS\\system32\\WindowsPowerShell\\v1.0;C:\\mozilla-build\\python27;C:\\mozilla-build\\python27\\Scripts;C:\\mozilla-build\\msys\\bin;C:\\mozilla-build\\vim\\vim72;C:\\mozilla-build\\wget;C:\\mozilla-build\\info-zip;C:\\CoreUtils\\bin;C:\\mozilla-build\\buildbotve\\scripts;C:\\mozilla-build\\hg', 'MOZ_AIRBAG': '1', 'PROMPT': '$P$G', 'USERNAME': 'cltbld', 'NO_FAIL_ON_TEST_ERRORS': '1', 'PATHEXT': '.COM;.EXE;.BAT;.CMD;.VBS;.VBE;.JS;.JSE;.WSF;.WSH;.PSC1', 'FP_NO_HOST_CHECK': 'NO', 'DCLOCATION': 'SCL3', 'APPDATA': 'C:\\Documents and Settings\\cltbld.T-XP32-IX-022\\Application Data', 'HOMEDRIVE': 'C:', 'MOZ_MSVCVERSION': '8', 'FRAMEWORKVERSION': 'v2.0.50727', 'SYSTEMDRIVE': 'C:', 'SLAVEDIR': 'C:\\slave\\', 'NUMBER_OF_PROCESSORS': '8', 'DEVENVDIR': 'D:\\msvs8\\Common7\\IDE', 'PWD': 'C:\\slave\\test', 'PROCESSOR_LEVEL': '6', 'KTS_HOME': 'C:\\Program Files\\KTS', 'PROPERTIES_FILE': 'C:\\slave\\test/buildprops.json', 'MOZ_CRASHREPORTER_NO_REPORT': '1', 'VCINSTALLDIR': 'D:\\msvs8\\VC', 'OS': 'Windows_NT', 'USERPROFILE': 'C:\\Documents and Settings\\cltbld.T-XP32-IX-022'}}, attempt #1 08:22:21 INFO - Running command: ['C:\\slave\\test\\build\\venv\\Scripts\\pip', 'install', '--timeout', '120', '--no-index', '--find-links', 'http://pypi.pvt.build.mozilla.org/pub', '--find-links', 'http://pypi.pub.build.mozilla.org/pub', 'psutil>=3.1.1'] in C:\slave\test\build 08:22:21 INFO - Copy/paste: C:\slave\test\build\venv\Scripts\pip install --timeout 120 --no-index --find-links http://pypi.pvt.build.mozilla.org/pub --find-links http://pypi.pub.build.mozilla.org/pub psutil>=3.1.1 08:22:21 INFO - Using env: {'ALLUSERSPROFILE': 'C:\\Documents and Settings\\All Users', 08:22:21 INFO - 'APPDATA': 'C:\\Documents and Settings\\cltbld.T-XP32-IX-022\\Application Data', 08:22:21 INFO - 'COMMONPROGRAMFILES': 'C:\\Program Files\\Common Files', 08:22:21 INFO - 'COMPUTERNAME': 'T-XP32-IX-022', 08:22:21 INFO - 'COMSPEC': 'C:\\WINDOWS\\system32\\cmd.exe', 08:22:21 INFO - 'DCLOCATION': 'SCL3', 08:22:21 INFO - 'DEVENVDIR': 'D:\\msvs8\\Common7\\IDE', 08:22:21 INFO - 'DNSSUFFIX': 'wintest.releng.scl3.mozilla.com', 08:22:21 INFO - 'FP_NO_HOST_CHECK': 'NO', 08:22:21 INFO - 'FRAMEWORKDIR': 'C:\\WINDOWS\\Microsoft.NET\\Framework', 08:22:21 INFO - 'FRAMEWORKSDKDIR': 'D:\\msvs8\\SDK\\v2.0', 08:22:21 INFO - 'FRAMEWORKVERSION': 'v2.0.50727', 08:22:21 INFO - 'HOMEDRIVE': 'C:', 08:22:21 INFO - 'HOMEPATH': '\\Documents and Settings\\cltbld.T-XP32-IX-022', 08:22:21 INFO - 'KTS_HOME': 'C:\\Program Files\\KTS', 08:22:21 INFO - 'KTS_VERSION': '1.19c', 08:22:21 INFO - 'LIBPATH': 'C:\\WINDOWS\\Microsoft.NET\\Framework\\v2.0.50727;D:\\msvs8\\VC\\ATLMFC\\LIB', 08:22:21 INFO - 'LOGONSERVER': '\\\\T-XP32-IX-022', 08:22:21 INFO - 'MONDIR': 'C:\\Monitor_config\\', 08:22:21 INFO - 'MOZBUILDDIR': 'C:\\mozilla-build\\', 08:22:21 INFO - 'MOZILLABUILD': 'D:\\mozilla-build', 08:22:21 INFO - 'MOZILLABUILDDRIVE': 'C:', 08:22:21 INFO - 'MOZILLABUILDPATH': '\\mozilla-build\\', 08:22:21 INFO - 'MOZ_AIRBAG': '1', 08:22:21 INFO - 'MOZ_CRASHREPORTER_NO_REPORT': '1', 08:22:21 INFO - 'MOZ_HIDE_RESULTS_TABLE': '1', 08:22:21 INFO - 'MOZ_MSVCVERSION': '8', 08:22:21 INFO - 'MOZ_NO_REMOTE': '1', 08:22:21 INFO - 'MOZ_TOOLS': 'D:\\mozilla-build\\moztools', 08:22:21 INFO - 'MSVCDIR': 'D:\\msvs8\\VC', 08:22:21 INFO - 'NO_EM_RESTART': '1', 08:22:21 INFO - 'NO_FAIL_ON_TEST_ERRORS': '1', 08:22:21 INFO - 'NUMBER_OF_PROCESSORS': '8', 08:22:21 INFO - 'OS': 'Windows_NT', 08:22:21 INFO - 'OURDRIVE': 'C:', 08:22:21 INFO - 'PATH': 'C:\\Program Files\\NVIDIA Corporation\\PhysX\\Common;C:\\WINDOWS\\system32;C:\\WINDOWS;C:\\WINDOWS\\System32\\Wbem;C:\\WINDOWS\\system32\\WindowsPowerShell\\v1.0;C:\\mozilla-build\\python27;C:\\mozilla-build\\python27\\Scripts;C:\\mozilla-build\\msys\\bin;C:\\mozilla-build\\vim\\vim72;C:\\mozilla-build\\wget;C:\\mozilla-build\\info-zip;C:\\CoreUtils\\bin;C:\\mozilla-build\\buildbotve\\scripts;C:\\mozilla-build\\hg', 08:22:21 INFO - 'PATHEXT': '.COM;.EXE;.BAT;.CMD;.VBS;.VBE;.JS;.JSE;.WSF;.WSH;.PSC1', 08:22:21 INFO - 'PROCESSOR_ARCHITECTURE': 'x86', 08:22:21 INFO - 'PROCESSOR_IDENTIFIER': 'x86 Family 6 Model 30 Stepping 5, GenuineIntel', 08:22:21 INFO - 'PROCESSOR_LEVEL': '6', 08:22:21 INFO - 'PROCESSOR_REVISION': '1e05', 08:22:21 INFO - 'PROGRAMFILES': 'C:\\Program Files', 08:22:21 INFO - 'PROMPT': '$P$G', 08:22:21 INFO - 'PROPERTIES_FILE': 'C:\\slave\\test/buildprops.json', 08:22:21 INFO - 'PWD': 'C:\\slave\\test', 08:22:21 INFO - 'RUNLOGFILE': 'C:\\slave\\\\runslave.log', 08:22:21 INFO - 'SESSIONNAME': 'Console', 08:22:21 INFO - 'SLAVEDIR': 'C:\\slave\\', 08:22:21 INFO - 'SYSTEMDRIVE': 'C:', 08:22:21 INFO - 'SYSTEMROOT': 'C:\\WINDOWS', 08:22:21 INFO - 'TEMP': 'C:\\DOCUME~1\\CLTBLD~1.T-X\\LOCALS~1\\Temp', 08:22:21 INFO - 'TEST1': 'testie', 08:22:21 INFO - 'TMP': 'C:\\DOCUME~1\\CLTBLD~1.T-X\\LOCALS~1\\Temp', 08:22:21 INFO - 'USERDOMAIN': 'T-XP32-IX-022', 08:22:21 INFO - 'USERNAME': 'cltbld', 08:22:21 INFO - 'USERPROFILE': 'C:\\Documents and Settings\\cltbld.T-XP32-IX-022', 08:22:21 INFO - 'VCINSTALLDIR': 'D:\\msvs8\\VC', 08:22:21 INFO - 'VCVARS': 'D:\\msvs8\\VC\\bin\\vcvars32.bat', 08:22:21 INFO - 'VSINSTALLDIR': 'D:\\msvs8', 08:22:21 INFO - 'WINDIR': 'C:\\WINDOWS', 08:22:21 INFO - 'XPCOM_DEBUG_BREAK': 'warn'} 08:22:22 INFO - Ignoring indexes: http://pypi.python.org/simple/ 08:22:22 INFO - Downloading/unpacking psutil>=3.1.1 08:22:22 INFO - Running setup.py egg_info for package psutil 08:22:22 INFO - warning: no previously-included files matching '*' found under directory 'docs\_build' 08:22:22 INFO - warning: manifest_maker: MANIFEST.in, line 18: 'recursive-include' expects ... 08:22:22 INFO - Installing collected packages: psutil 08:22:22 INFO - Running setup.py install for psutil 08:22:22 INFO - building 'psutil._psutil_windows' extension 08:22:22 INFO - error: Unable to find vcvarsall.bat 08:22:22 INFO - Complete output from command C:\slave\test\build\venv\Scripts\python.exe -c "import setuptools;__file__='C:\\slave\\test\\build\\venv\\build\\psutil\\setup.py';execfile(__file__)" install --single-version-externally-managed --record c:\docume~1\cltbld~1.t-x\locals~1\temp\pip-pea6rf-record\install-record.txt --install-headers C:\slave\test\build\venv\include\site\python2.7: 08:22:22 INFO - running install 08:22:22 INFO - running build 08:22:22 INFO - running build_py 08:22:22 INFO - creating build 08:22:22 INFO - creating build\lib.win32-2.7 08:22:22 INFO - creating build\lib.win32-2.7\psutil 08:22:22 INFO - copying psutil\_common.py -> build\lib.win32-2.7\psutil 08:22:22 INFO - copying psutil\_compat.py -> build\lib.win32-2.7\psutil 08:22:22 INFO - copying psutil\_psbsd.py -> build\lib.win32-2.7\psutil 08:22:22 INFO - copying psutil\_pslinux.py -> build\lib.win32-2.7\psutil 08:22:22 INFO - copying psutil\_psosx.py -> build\lib.win32-2.7\psutil 08:22:22 INFO - copying psutil\_psposix.py -> build\lib.win32-2.7\psutil 08:22:22 INFO - copying psutil\_pssunos.py -> build\lib.win32-2.7\psutil 08:22:22 INFO - copying psutil\_pswindows.py -> build\lib.win32-2.7\psutil 08:22:22 INFO - copying psutil\__init__.py -> build\lib.win32-2.7\psutil 08:22:22 INFO - running build_ext 08:22:22 INFO - building 'psutil._psutil_windows' extension 08:22:22 INFO - error: Unable to find vcvarsall.bat 08:22:22 INFO - ---------------------------------------- 08:22:22 INFO - Command C:\slave\test\build\venv\Scripts\python.exe -c "import setuptools;__file__='C:\\slave\\test\\build\\venv\\build\\psutil\\setup.py';execfile(__file__)" install --single-version-externally-managed --record c:\docume~1\cltbld~1.t-x\locals~1\temp\pip-pea6rf-record\install-record.txt --install-headers C:\slave\test\build\venv\include\site\python2.7 failed with error code 1 08:22:22 INFO - Storing complete log in C:\Documents and Settings\cltbld.T-XP32-IX-022\Application Data\pip\pip.log 08:22:22 WARNING - Return code: 1 08:22:22 WARNING - Could not install python package: C:\slave\test\build\venv\Scripts\pip install --timeout 120 --no-index --find-links http://pypi.pvt.build.mozilla.org/pub --find-links http://pypi.pub.build.mozilla.org/pub psutil>=3.1.1 failed after 1 tries! 08:22:22 INFO - Installing mozsystemmonitor==0.3 into virtualenv C:\slave\test\build\venv 08:22:22 INFO - proxxy config: {'regions': ['.use1.', '.usw2.', '.scl3'], 'instances': ['proxxy1.srv.releng.use1.mozilla.com', 'proxxy1.srv.releng.usw2.mozilla.com', 'proxxy1.srv.releng.scl3.mozilla.com'], 'urls': [('http://ftp.mozilla.org', 'ftp.mozilla.org'), ('https://ftp.mozilla.org', 'ftp.mozilla.org'), ('https://ftp-ssl.mozilla.org', 'ftp.mozilla.org'), ('http://pypi.pvt.build.mozilla.org', 'pypi.pvt.build.mozilla.org'), ('http://pypi.pub.build.mozilla.org', 'pypi.pub.build.mozilla.org')]} 08:22:22 INFO - http://pypi.pvt.build.mozilla.org/pub matches http://pypi.pvt.build.mozilla.org 08:22:22 INFO - proxxy config: {'regions': ['.use1.', '.usw2.', '.scl3'], 'instances': ['proxxy1.srv.releng.use1.mozilla.com', 'proxxy1.srv.releng.usw2.mozilla.com', 'proxxy1.srv.releng.scl3.mozilla.com'], 'urls': [('http://ftp.mozilla.org', 'ftp.mozilla.org'), ('https://ftp.mozilla.org', 'ftp.mozilla.org'), ('https://ftp-ssl.mozilla.org', 'ftp.mozilla.org'), ('http://pypi.pvt.build.mozilla.org', 'pypi.pvt.build.mozilla.org'), ('http://pypi.pub.build.mozilla.org', 'pypi.pub.build.mozilla.org')]} 08:22:22 INFO - http://pypi.pub.build.mozilla.org/pub matches http://pypi.pub.build.mozilla.org 08:22:22 INFO - retry: Calling run_command with args: [['C:\\slave\\test\\build\\venv\\Scripts\\pip', 'install', '--timeout', '120', '--no-index', '--find-links', 'http://pypi.pvt.build.mozilla.org/pub', '--find-links', 'http://pypi.pub.build.mozilla.org/pub', 'mozsystemmonitor==0.3']], kwargs: {'error_level': 'warning', 'error_list': [{'substr': 'not found or a compiler error:', 'level': 'warning'}, {'regex': <_sre.SRE_Pattern object at 0x00A4EE90>, 'level': 'error'}, {'regex': <_sre.SRE_Pattern object at 0x00ADEA70>, 'level': 'warning'}, {'regex': <_sre.SRE_Pattern object at 0x00C46F80>, 'level': 'debug'}, {'substr': 'command not found', 'level': 'error'}, {'regex': <_sre.SRE_Pattern object at 0x00B99368>, 'level': 'warning'}, {'substr': 'Traceback (most recent call last)', 'level': 'error'}, {'substr': 'SyntaxError: ', 'level': 'error'}, {'substr': 'TypeError: ', 'level': 'error'}, {'substr': 'NameError: ', 'level': 'error'}, {'substr': 'ZeroDivisionError: ', 'level': 'error'}, {'regex': <_sre.SRE_Pattern object at 0x00A7A700>, 'level': 'critical'}, {'regex': <_sre.SRE_Pattern object at 0x00B982A0>, 'level': 'critical'}], 'cwd': 'C:\\slave\\test\\build', 'env': {'TMP': 'C:\\DOCUME~1\\CLTBLD~1.T-X\\LOCALS~1\\Temp', 'MOZILLABUILD': 'D:\\mozilla-build', 'COMPUTERNAME': 'T-XP32-IX-022', 'USERDOMAIN': 'T-XP32-IX-022', 'KTS_VERSION': '1.19c', 'LIBPATH': 'C:\\WINDOWS\\Microsoft.NET\\Framework\\v2.0.50727;D:\\msvs8\\VC\\ATLMFC\\LIB', 'COMMONPROGRAMFILES': 'C:\\Program Files\\Common Files', 'MOZILLABUILDPATH': '\\mozilla-build\\', 'PROCESSOR_IDENTIFIER': 'x86 Family 6 Model 30 Stepping 5, GenuineIntel', 'PROGRAMFILES': 'C:\\Program Files', 'PROCESSOR_REVISION': '1e05', 'DNSSUFFIX': 'wintest.releng.scl3.mozilla.com', 'SYSTEMROOT': 'C:\\WINDOWS', 'NO_EM_RESTART': '1', 'OURDRIVE': 'C:', 'MSVCDIR': 'D:\\msvs8\\VC', 'XPCOM_DEBUG_BREAK': 'warn', 'MONDIR': 'C:\\Monitor_config\\', 'TEMP': 'C:\\DOCUME~1\\CLTBLD~1.T-X\\LOCALS~1\\Temp', 'COMSPEC': 'C:\\WINDOWS\\system32\\cmd.exe', 'RUNLOGFILE': 'C:\\slave\\\\runslave.log', 'PROCESSOR_ARCHITECTURE': 'x86', 'VCVARS': 'D:\\msvs8\\VC\\bin\\vcvars32.bat', 'VSINSTALLDIR': 'D:\\msvs8', 'ALLUSERSPROFILE': 'C:\\Documents and Settings\\All Users', 'MOZILLABUILDDRIVE': 'C:', 'SESSIONNAME': 'Console', 'HOMEPATH': '\\Documents and Settings\\cltbld.T-XP32-IX-022', 'FRAMEWORKDIR': 'C:\\WINDOWS\\Microsoft.NET\\Framework', 'MOZBUILDDIR': 'C:\\mozilla-build\\', 'FRAMEWORKSDKDIR': 'D:\\msvs8\\SDK\\v2.0', 'TEST1': 'testie', 'LOGONSERVER': '\\\\T-XP32-IX-022', 'MOZ_NO_REMOTE': '1', 'MOZ_HIDE_RESULTS_TABLE': '1', 'WINDIR': 'C:\\WINDOWS', 'MOZ_TOOLS': 'D:\\mozilla-build\\moztools', 'PATH': 'C:\\Program Files\\NVIDIA Corporation\\PhysX\\Common;C:\\WINDOWS\\system32;C:\\WINDOWS;C:\\WINDOWS\\System32\\Wbem;C:\\WINDOWS\\system32\\WindowsPowerShell\\v1.0;C:\\mozilla-build\\python27;C:\\mozilla-build\\python27\\Scripts;C:\\mozilla-build\\msys\\bin;C:\\mozilla-build\\vim\\vim72;C:\\mozilla-build\\wget;C:\\mozilla-build\\info-zip;C:\\CoreUtils\\bin;C:\\mozilla-build\\buildbotve\\scripts;C:\\mozilla-build\\hg', 'MOZ_AIRBAG': '1', 'PROMPT': '$P$G', 'USERNAME': 'cltbld', 'NO_FAIL_ON_TEST_ERRORS': '1', 'PATHEXT': '.COM;.EXE;.BAT;.CMD;.VBS;.VBE;.JS;.JSE;.WSF;.WSH;.PSC1', 'FP_NO_HOST_CHECK': 'NO', 'DCLOCATION': 'SCL3', 'APPDATA': 'C:\\Documents and Settings\\cltbld.T-XP32-IX-022\\Application Data', 'HOMEDRIVE': 'C:', 'MOZ_MSVCVERSION': '8', 'FRAMEWORKVERSION': 'v2.0.50727', 'SYSTEMDRIVE': 'C:', 'SLAVEDIR': 'C:\\slave\\', 'NUMBER_OF_PROCESSORS': '8', 'DEVENVDIR': 'D:\\msvs8\\Common7\\IDE', 'PWD': 'C:\\slave\\test', 'PROCESSOR_LEVEL': '6', 'KTS_HOME': 'C:\\Program Files\\KTS', 'PROPERTIES_FILE': 'C:\\slave\\test/buildprops.json', 'MOZ_CRASHREPORTER_NO_REPORT': '1', 'VCINSTALLDIR': 'D:\\msvs8\\VC', 'OS': 'Windows_NT', 'USERPROFILE': 'C:\\Documents and Settings\\cltbld.T-XP32-IX-022'}}, attempt #1 08:22:22 INFO - Running command: ['C:\\slave\\test\\build\\venv\\Scripts\\pip', 'install', '--timeout', '120', '--no-index', '--find-links', 'http://pypi.pvt.build.mozilla.org/pub', '--find-links', 'http://pypi.pub.build.mozilla.org/pub', 'mozsystemmonitor==0.3'] in C:\slave\test\build 08:22:22 INFO - Copy/paste: C:\slave\test\build\venv\Scripts\pip install --timeout 120 --no-index --find-links http://pypi.pvt.build.mozilla.org/pub --find-links http://pypi.pub.build.mozilla.org/pub mozsystemmonitor==0.3 08:22:22 INFO - Using env: {'ALLUSERSPROFILE': 'C:\\Documents and Settings\\All Users', 08:22:22 INFO - 'APPDATA': 'C:\\Documents and Settings\\cltbld.T-XP32-IX-022\\Application Data', 08:22:22 INFO - 'COMMONPROGRAMFILES': 'C:\\Program Files\\Common Files', 08:22:22 INFO - 'COMPUTERNAME': 'T-XP32-IX-022', 08:22:22 INFO - 'COMSPEC': 'C:\\WINDOWS\\system32\\cmd.exe', 08:22:22 INFO - 'DCLOCATION': 'SCL3', 08:22:22 INFO - 'DEVENVDIR': 'D:\\msvs8\\Common7\\IDE', 08:22:22 INFO - 'DNSSUFFIX': 'wintest.releng.scl3.mozilla.com', 08:22:22 INFO - 'FP_NO_HOST_CHECK': 'NO', 08:22:22 INFO - 'FRAMEWORKDIR': 'C:\\WINDOWS\\Microsoft.NET\\Framework', 08:22:22 INFO - 'FRAMEWORKSDKDIR': 'D:\\msvs8\\SDK\\v2.0', 08:22:22 INFO - 'FRAMEWORKVERSION': 'v2.0.50727', 08:22:22 INFO - 'HOMEDRIVE': 'C:', 08:22:22 INFO - 'HOMEPATH': '\\Documents and Settings\\cltbld.T-XP32-IX-022', 08:22:22 INFO - 'KTS_HOME': 'C:\\Program Files\\KTS', 08:22:22 INFO - 'KTS_VERSION': '1.19c', 08:22:22 INFO - 'LIBPATH': 'C:\\WINDOWS\\Microsoft.NET\\Framework\\v2.0.50727;D:\\msvs8\\VC\\ATLMFC\\LIB', 08:22:22 INFO - 'LOGONSERVER': '\\\\T-XP32-IX-022', 08:22:22 INFO - 'MONDIR': 'C:\\Monitor_config\\', 08:22:22 INFO - 'MOZBUILDDIR': 'C:\\mozilla-build\\', 08:22:22 INFO - 'MOZILLABUILD': 'D:\\mozilla-build', 08:22:22 INFO - 'MOZILLABUILDDRIVE': 'C:', 08:22:22 INFO - 'MOZILLABUILDPATH': '\\mozilla-build\\', 08:22:22 INFO - 'MOZ_AIRBAG': '1', 08:22:22 INFO - 'MOZ_CRASHREPORTER_NO_REPORT': '1', 08:22:22 INFO - 'MOZ_HIDE_RESULTS_TABLE': '1', 08:22:22 INFO - 'MOZ_MSVCVERSION': '8', 08:22:22 INFO - 'MOZ_NO_REMOTE': '1', 08:22:22 INFO - 'MOZ_TOOLS': 'D:\\mozilla-build\\moztools', 08:22:22 INFO - 'MSVCDIR': 'D:\\msvs8\\VC', 08:22:22 INFO - 'NO_EM_RESTART': '1', 08:22:22 INFO - 'NO_FAIL_ON_TEST_ERRORS': '1', 08:22:22 INFO - 'NUMBER_OF_PROCESSORS': '8', 08:22:22 INFO - 'OS': 'Windows_NT', 08:22:22 INFO - 'OURDRIVE': 'C:', 08:22:22 INFO - 'PATH': 'C:\\Program Files\\NVIDIA Corporation\\PhysX\\Common;C:\\WINDOWS\\system32;C:\\WINDOWS;C:\\WINDOWS\\System32\\Wbem;C:\\WINDOWS\\system32\\WindowsPowerShell\\v1.0;C:\\mozilla-build\\python27;C:\\mozilla-build\\python27\\Scripts;C:\\mozilla-build\\msys\\bin;C:\\mozilla-build\\vim\\vim72;C:\\mozilla-build\\wget;C:\\mozilla-build\\info-zip;C:\\CoreUtils\\bin;C:\\mozilla-build\\buildbotve\\scripts;C:\\mozilla-build\\hg', 08:22:22 INFO - 'PATHEXT': '.COM;.EXE;.BAT;.CMD;.VBS;.VBE;.JS;.JSE;.WSF;.WSH;.PSC1', 08:22:22 INFO - 'PROCESSOR_ARCHITECTURE': 'x86', 08:22:22 INFO - 'PROCESSOR_IDENTIFIER': 'x86 Family 6 Model 30 Stepping 5, GenuineIntel', 08:22:22 INFO - 'PROCESSOR_LEVEL': '6', 08:22:22 INFO - 'PROCESSOR_REVISION': '1e05', 08:22:22 INFO - 'PROGRAMFILES': 'C:\\Program Files', 08:22:22 INFO - 'PROMPT': '$P$G', 08:22:22 INFO - 'PROPERTIES_FILE': 'C:\\slave\\test/buildprops.json', 08:22:22 INFO - 'PWD': 'C:\\slave\\test', 08:22:22 INFO - 'RUNLOGFILE': 'C:\\slave\\\\runslave.log', 08:22:22 INFO - 'SESSIONNAME': 'Console', 08:22:22 INFO - 'SLAVEDIR': 'C:\\slave\\', 08:22:22 INFO - 'SYSTEMDRIVE': 'C:', 08:22:22 INFO - 'SYSTEMROOT': 'C:\\WINDOWS', 08:22:22 INFO - 'TEMP': 'C:\\DOCUME~1\\CLTBLD~1.T-X\\LOCALS~1\\Temp', 08:22:22 INFO - 'TEST1': 'testie', 08:22:22 INFO - 'TMP': 'C:\\DOCUME~1\\CLTBLD~1.T-X\\LOCALS~1\\Temp', 08:22:22 INFO - 'USERDOMAIN': 'T-XP32-IX-022', 08:22:22 INFO - 'USERNAME': 'cltbld', 08:22:22 INFO - 'USERPROFILE': 'C:\\Documents and Settings\\cltbld.T-XP32-IX-022', 08:22:22 INFO - 'VCINSTALLDIR': 'D:\\msvs8\\VC', 08:22:22 INFO - 'VCVARS': 'D:\\msvs8\\VC\\bin\\vcvars32.bat', 08:22:22 INFO - 'VSINSTALLDIR': 'D:\\msvs8', 08:22:22 INFO - 'WINDIR': 'C:\\WINDOWS', 08:22:22 INFO - 'XPCOM_DEBUG_BREAK': 'warn'} 08:22:26 INFO - Ignoring indexes: http://pypi.python.org/simple/ 08:22:26 INFO - Downloading/unpacking mozsystemmonitor==0.3 08:22:26 INFO - Downloading mozsystemmonitor-0.3.tar.gz 08:22:26 INFO - Running setup.py egg_info for package mozsystemmonitor 08:22:26 INFO - Downloading/unpacking psutil>=3.1.1 (from mozsystemmonitor==0.3) 08:22:26 INFO - Running setup.py egg_info for package psutil 08:22:26 INFO - warning: no previously-included files matching '*' found under directory 'docs\_build' 08:22:26 INFO - warning: manifest_maker: MANIFEST.in, line 18: 'recursive-include' expects ... 08:22:26 INFO - Installing collected packages: mozsystemmonitor, psutil 08:22:26 INFO - Running setup.py install for mozsystemmonitor 08:22:26 INFO - Running setup.py install for psutil 08:22:26 INFO - building 'psutil._psutil_windows' extension 08:22:26 INFO - error: Unable to find vcvarsall.bat 08:22:26 INFO - Complete output from command C:\slave\test\build\venv\Scripts\python.exe -c "import setuptools;__file__='C:\\slave\\test\\build\\venv\\build\\psutil\\setup.py';execfile(__file__)" install --single-version-externally-managed --record c:\docume~1\cltbld~1.t-x\locals~1\temp\pip-g56kk0-record\install-record.txt --install-headers C:\slave\test\build\venv\include\site\python2.7: 08:22:26 INFO - running install 08:22:26 INFO - running build 08:22:26 INFO - running build_py 08:22:26 INFO - running build_ext 08:22:26 INFO - building 'psutil._psutil_windows' extension 08:22:26 INFO - error: Unable to find vcvarsall.bat 08:22:26 INFO - ---------------------------------------- 08:22:26 INFO - Command C:\slave\test\build\venv\Scripts\python.exe -c "import setuptools;__file__='C:\\slave\\test\\build\\venv\\build\\psutil\\setup.py';execfile(__file__)" install --single-version-externally-managed --record c:\docume~1\cltbld~1.t-x\locals~1\temp\pip-g56kk0-record\install-record.txt --install-headers C:\slave\test\build\venv\include\site\python2.7 failed with error code 1 08:22:26 INFO - Storing complete log in C:\Documents and Settings\cltbld.T-XP32-IX-022\Application Data\pip\pip.log 08:22:26 WARNING - Return code: 1 08:22:26 WARNING - Could not install python package: C:\slave\test\build\venv\Scripts\pip install --timeout 120 --no-index --find-links http://pypi.pvt.build.mozilla.org/pub --find-links http://pypi.pub.build.mozilla.org/pub mozsystemmonitor==0.3 failed after 1 tries! 08:22:26 INFO - Installing jsonschema==2.5.1 into virtualenv C:\slave\test\build\venv 08:22:26 INFO - proxxy config: {'regions': ['.use1.', '.usw2.', '.scl3'], 'instances': ['proxxy1.srv.releng.use1.mozilla.com', 'proxxy1.srv.releng.usw2.mozilla.com', 'proxxy1.srv.releng.scl3.mozilla.com'], 'urls': [('http://ftp.mozilla.org', 'ftp.mozilla.org'), ('https://ftp.mozilla.org', 'ftp.mozilla.org'), ('https://ftp-ssl.mozilla.org', 'ftp.mozilla.org'), ('http://pypi.pvt.build.mozilla.org', 'pypi.pvt.build.mozilla.org'), ('http://pypi.pub.build.mozilla.org', 'pypi.pub.build.mozilla.org')]} 08:22:26 INFO - http://pypi.pvt.build.mozilla.org/pub matches http://pypi.pvt.build.mozilla.org 08:22:26 INFO - proxxy config: {'regions': ['.use1.', '.usw2.', '.scl3'], 'instances': ['proxxy1.srv.releng.use1.mozilla.com', 'proxxy1.srv.releng.usw2.mozilla.com', 'proxxy1.srv.releng.scl3.mozilla.com'], 'urls': [('http://ftp.mozilla.org', 'ftp.mozilla.org'), ('https://ftp.mozilla.org', 'ftp.mozilla.org'), ('https://ftp-ssl.mozilla.org', 'ftp.mozilla.org'), ('http://pypi.pvt.build.mozilla.org', 'pypi.pvt.build.mozilla.org'), ('http://pypi.pub.build.mozilla.org', 'pypi.pub.build.mozilla.org')]} 08:22:26 INFO - http://pypi.pub.build.mozilla.org/pub matches http://pypi.pub.build.mozilla.org 08:22:26 INFO - retry: Calling run_command with args: [['C:\\slave\\test\\build\\venv\\Scripts\\pip', 'install', '--timeout', '120', '--no-index', '--find-links', 'http://pypi.pvt.build.mozilla.org/pub', '--find-links', 'http://pypi.pub.build.mozilla.org/pub', 'jsonschema==2.5.1']], kwargs: {'error_level': 'warning', 'error_list': [{'substr': 'not found or a compiler error:', 'level': 'warning'}, {'regex': <_sre.SRE_Pattern object at 0x00A4EE90>, 'level': 'error'}, {'regex': <_sre.SRE_Pattern object at 0x00ADEA70>, 'level': 'warning'}, {'regex': <_sre.SRE_Pattern object at 0x00C46F80>, 'level': 'debug'}, {'substr': 'command not found', 'level': 'error'}, {'regex': <_sre.SRE_Pattern object at 0x00B99368>, 'level': 'warning'}, {'substr': 'Traceback (most recent call last)', 'level': 'error'}, {'substr': 'SyntaxError: ', 'level': 'error'}, {'substr': 'TypeError: ', 'level': 'error'}, {'substr': 'NameError: ', 'level': 'error'}, {'substr': 'ZeroDivisionError: ', 'level': 'error'}, {'regex': <_sre.SRE_Pattern object at 0x00A7A700>, 'level': 'critical'}, {'regex': <_sre.SRE_Pattern object at 0x00B982A0>, 'level': 'critical'}], 'cwd': 'C:\\slave\\test\\build', 'env': {'TMP': 'C:\\DOCUME~1\\CLTBLD~1.T-X\\LOCALS~1\\Temp', 'MOZILLABUILD': 'D:\\mozilla-build', 'COMPUTERNAME': 'T-XP32-IX-022', 'USERDOMAIN': 'T-XP32-IX-022', 'KTS_VERSION': '1.19c', 'LIBPATH': 'C:\\WINDOWS\\Microsoft.NET\\Framework\\v2.0.50727;D:\\msvs8\\VC\\ATLMFC\\LIB', 'COMMONPROGRAMFILES': 'C:\\Program Files\\Common Files', 'MOZILLABUILDPATH': '\\mozilla-build\\', 'PROCESSOR_IDENTIFIER': 'x86 Family 6 Model 30 Stepping 5, GenuineIntel', 'PROGRAMFILES': 'C:\\Program Files', 'PROCESSOR_REVISION': '1e05', 'DNSSUFFIX': 'wintest.releng.scl3.mozilla.com', 'SYSTEMROOT': 'C:\\WINDOWS', 'NO_EM_RESTART': '1', 'OURDRIVE': 'C:', 'MSVCDIR': 'D:\\msvs8\\VC', 'XPCOM_DEBUG_BREAK': 'warn', 'MONDIR': 'C:\\Monitor_config\\', 'TEMP': 'C:\\DOCUME~1\\CLTBLD~1.T-X\\LOCALS~1\\Temp', 'COMSPEC': 'C:\\WINDOWS\\system32\\cmd.exe', 'RUNLOGFILE': 'C:\\slave\\\\runslave.log', 'PROCESSOR_ARCHITECTURE': 'x86', 'VCVARS': 'D:\\msvs8\\VC\\bin\\vcvars32.bat', 'VSINSTALLDIR': 'D:\\msvs8', 'ALLUSERSPROFILE': 'C:\\Documents and Settings\\All Users', 'MOZILLABUILDDRIVE': 'C:', 'SESSIONNAME': 'Console', 'HOMEPATH': '\\Documents and Settings\\cltbld.T-XP32-IX-022', 'FRAMEWORKDIR': 'C:\\WINDOWS\\Microsoft.NET\\Framework', 'MOZBUILDDIR': 'C:\\mozilla-build\\', 'FRAMEWORKSDKDIR': 'D:\\msvs8\\SDK\\v2.0', 'TEST1': 'testie', 'LOGONSERVER': '\\\\T-XP32-IX-022', 'MOZ_NO_REMOTE': '1', 'MOZ_HIDE_RESULTS_TABLE': '1', 'WINDIR': 'C:\\WINDOWS', 'MOZ_TOOLS': 'D:\\mozilla-build\\moztools', 'PATH': 'C:\\Program Files\\NVIDIA Corporation\\PhysX\\Common;C:\\WINDOWS\\system32;C:\\WINDOWS;C:\\WINDOWS\\System32\\Wbem;C:\\WINDOWS\\system32\\WindowsPowerShell\\v1.0;C:\\mozilla-build\\python27;C:\\mozilla-build\\python27\\Scripts;C:\\mozilla-build\\msys\\bin;C:\\mozilla-build\\vim\\vim72;C:\\mozilla-build\\wget;C:\\mozilla-build\\info-zip;C:\\CoreUtils\\bin;C:\\mozilla-build\\buildbotve\\scripts;C:\\mozilla-build\\hg', 'MOZ_AIRBAG': '1', 'PROMPT': '$P$G', 'USERNAME': 'cltbld', 'NO_FAIL_ON_TEST_ERRORS': '1', 'PATHEXT': '.COM;.EXE;.BAT;.CMD;.VBS;.VBE;.JS;.JSE;.WSF;.WSH;.PSC1', 'FP_NO_HOST_CHECK': 'NO', 'DCLOCATION': 'SCL3', 'APPDATA': 'C:\\Documents and Settings\\cltbld.T-XP32-IX-022\\Application Data', 'HOMEDRIVE': 'C:', 'MOZ_MSVCVERSION': '8', 'FRAMEWORKVERSION': 'v2.0.50727', 'SYSTEMDRIVE': 'C:', 'SLAVEDIR': 'C:\\slave\\', 'NUMBER_OF_PROCESSORS': '8', 'DEVENVDIR': 'D:\\msvs8\\Common7\\IDE', 'PWD': 'C:\\slave\\test', 'PROCESSOR_LEVEL': '6', 'KTS_HOME': 'C:\\Program Files\\KTS', 'PROPERTIES_FILE': 'C:\\slave\\test/buildprops.json', 'MOZ_CRASHREPORTER_NO_REPORT': '1', 'VCINSTALLDIR': 'D:\\msvs8\\VC', 'OS': 'Windows_NT', 'USERPROFILE': 'C:\\Documents and Settings\\cltbld.T-XP32-IX-022'}}, attempt #1 08:22:26 INFO - Running command: ['C:\\slave\\test\\build\\venv\\Scripts\\pip', 'install', '--timeout', '120', '--no-index', '--find-links', 'http://pypi.pvt.build.mozilla.org/pub', '--find-links', 'http://pypi.pub.build.mozilla.org/pub', 'jsonschema==2.5.1'] in C:\slave\test\build 08:22:26 INFO - Copy/paste: C:\slave\test\build\venv\Scripts\pip install --timeout 120 --no-index --find-links http://pypi.pvt.build.mozilla.org/pub --find-links http://pypi.pub.build.mozilla.org/pub jsonschema==2.5.1 08:22:26 INFO - Using env: {'ALLUSERSPROFILE': 'C:\\Documents and Settings\\All Users', 08:22:26 INFO - 'APPDATA': 'C:\\Documents and Settings\\cltbld.T-XP32-IX-022\\Application Data', 08:22:26 INFO - 'COMMONPROGRAMFILES': 'C:\\Program Files\\Common Files', 08:22:26 INFO - 'COMPUTERNAME': 'T-XP32-IX-022', 08:22:26 INFO - 'COMSPEC': 'C:\\WINDOWS\\system32\\cmd.exe', 08:22:26 INFO - 'DCLOCATION': 'SCL3', 08:22:26 INFO - 'DEVENVDIR': 'D:\\msvs8\\Common7\\IDE', 08:22:26 INFO - 'DNSSUFFIX': 'wintest.releng.scl3.mozilla.com', 08:22:26 INFO - 'FP_NO_HOST_CHECK': 'NO', 08:22:26 INFO - 'FRAMEWORKDIR': 'C:\\WINDOWS\\Microsoft.NET\\Framework', 08:22:26 INFO - 'FRAMEWORKSDKDIR': 'D:\\msvs8\\SDK\\v2.0', 08:22:26 INFO - 'FRAMEWORKVERSION': 'v2.0.50727', 08:22:26 INFO - 'HOMEDRIVE': 'C:', 08:22:26 INFO - 'HOMEPATH': '\\Documents and Settings\\cltbld.T-XP32-IX-022', 08:22:26 INFO - 'KTS_HOME': 'C:\\Program Files\\KTS', 08:22:26 INFO - 'KTS_VERSION': '1.19c', 08:22:26 INFO - 'LIBPATH': 'C:\\WINDOWS\\Microsoft.NET\\Framework\\v2.0.50727;D:\\msvs8\\VC\\ATLMFC\\LIB', 08:22:26 INFO - 'LOGONSERVER': '\\\\T-XP32-IX-022', 08:22:26 INFO - 'MONDIR': 'C:\\Monitor_config\\', 08:22:26 INFO - 'MOZBUILDDIR': 'C:\\mozilla-build\\', 08:22:26 INFO - 'MOZILLABUILD': 'D:\\mozilla-build', 08:22:26 INFO - 'MOZILLABUILDDRIVE': 'C:', 08:22:26 INFO - 'MOZILLABUILDPATH': '\\mozilla-build\\', 08:22:26 INFO - 'MOZ_AIRBAG': '1', 08:22:26 INFO - 'MOZ_CRASHREPORTER_NO_REPORT': '1', 08:22:26 INFO - 'MOZ_HIDE_RESULTS_TABLE': '1', 08:22:26 INFO - 'MOZ_MSVCVERSION': '8', 08:22:26 INFO - 'MOZ_NO_REMOTE': '1', 08:22:26 INFO - 'MOZ_TOOLS': 'D:\\mozilla-build\\moztools', 08:22:26 INFO - 'MSVCDIR': 'D:\\msvs8\\VC', 08:22:26 INFO - 'NO_EM_RESTART': '1', 08:22:26 INFO - 'NO_FAIL_ON_TEST_ERRORS': '1', 08:22:26 INFO - 'NUMBER_OF_PROCESSORS': '8', 08:22:26 INFO - 'OS': 'Windows_NT', 08:22:26 INFO - 'OURDRIVE': 'C:', 08:22:26 INFO - 'PATH': 'C:\\Program Files\\NVIDIA Corporation\\PhysX\\Common;C:\\WINDOWS\\system32;C:\\WINDOWS;C:\\WINDOWS\\System32\\Wbem;C:\\WINDOWS\\system32\\WindowsPowerShell\\v1.0;C:\\mozilla-build\\python27;C:\\mozilla-build\\python27\\Scripts;C:\\mozilla-build\\msys\\bin;C:\\mozilla-build\\vim\\vim72;C:\\mozilla-build\\wget;C:\\mozilla-build\\info-zip;C:\\CoreUtils\\bin;C:\\mozilla-build\\buildbotve\\scripts;C:\\mozilla-build\\hg', 08:22:26 INFO - 'PATHEXT': '.COM;.EXE;.BAT;.CMD;.VBS;.VBE;.JS;.JSE;.WSF;.WSH;.PSC1', 08:22:26 INFO - 'PROCESSOR_ARCHITECTURE': 'x86', 08:22:26 INFO - 'PROCESSOR_IDENTIFIER': 'x86 Family 6 Model 30 Stepping 5, GenuineIntel', 08:22:26 INFO - 'PROCESSOR_LEVEL': '6', 08:22:26 INFO - 'PROCESSOR_REVISION': '1e05', 08:22:26 INFO - 'PROGRAMFILES': 'C:\\Program Files', 08:22:26 INFO - 'PROMPT': '$P$G', 08:22:26 INFO - 'PROPERTIES_FILE': 'C:\\slave\\test/buildprops.json', 08:22:26 INFO - 'PWD': 'C:\\slave\\test', 08:22:26 INFO - 'RUNLOGFILE': 'C:\\slave\\\\runslave.log', 08:22:26 INFO - 'SESSIONNAME': 'Console', 08:22:26 INFO - 'SLAVEDIR': 'C:\\slave\\', 08:22:26 INFO - 'SYSTEMDRIVE': 'C:', 08:22:26 INFO - 'SYSTEMROOT': 'C:\\WINDOWS', 08:22:26 INFO - 'TEMP': 'C:\\DOCUME~1\\CLTBLD~1.T-X\\LOCALS~1\\Temp', 08:22:26 INFO - 'TEST1': 'testie', 08:22:26 INFO - 'TMP': 'C:\\DOCUME~1\\CLTBLD~1.T-X\\LOCALS~1\\Temp', 08:22:26 INFO - 'USERDOMAIN': 'T-XP32-IX-022', 08:22:26 INFO - 'USERNAME': 'cltbld', 08:22:26 INFO - 'USERPROFILE': 'C:\\Documents and Settings\\cltbld.T-XP32-IX-022', 08:22:26 INFO - 'VCINSTALLDIR': 'D:\\msvs8\\VC', 08:22:26 INFO - 'VCVARS': 'D:\\msvs8\\VC\\bin\\vcvars32.bat', 08:22:26 INFO - 'VSINSTALLDIR': 'D:\\msvs8', 08:22:26 INFO - 'WINDIR': 'C:\\WINDOWS', 08:22:26 INFO - 'XPCOM_DEBUG_BREAK': 'warn'} 08:22:27 INFO - Ignoring indexes: http://pypi.python.org/simple/ 08:22:27 INFO - Downloading/unpacking jsonschema==2.5.1 08:22:28 INFO - Running setup.py egg_info for package jsonschema 08:22:28 INFO - zip_safe flag not set; analyzing archive contents... 08:22:28 INFO - install_dir . 08:22:28 INFO - Installed c:\slave\test\build\venv\build\jsonschema\vcversioner-2.16.0.0-py2.7.egg 08:22:28 INFO - Installing collected packages: jsonschema 08:22:28 INFO - Running setup.py install for jsonschema 08:22:28 INFO - Installing jsonschema-script.py script to C:\slave\test\build\venv\Scripts 08:22:28 INFO - Installing jsonschema.exe script to C:\slave\test\build\venv\Scripts 08:22:28 INFO - Successfully installed jsonschema 08:22:28 INFO - Cleaning up... 08:22:28 INFO - Return code: 0 08:22:28 INFO - Installing functools32==3.2.3-2 into virtualenv C:\slave\test\build\venv 08:22:28 INFO - proxxy config: {'regions': ['.use1.', '.usw2.', '.scl3'], 'instances': ['proxxy1.srv.releng.use1.mozilla.com', 'proxxy1.srv.releng.usw2.mozilla.com', 'proxxy1.srv.releng.scl3.mozilla.com'], 'urls': [('http://ftp.mozilla.org', 'ftp.mozilla.org'), ('https://ftp.mozilla.org', 'ftp.mozilla.org'), ('https://ftp-ssl.mozilla.org', 'ftp.mozilla.org'), ('http://pypi.pvt.build.mozilla.org', 'pypi.pvt.build.mozilla.org'), ('http://pypi.pub.build.mozilla.org', 'pypi.pub.build.mozilla.org')]} 08:22:28 INFO - http://pypi.pvt.build.mozilla.org/pub matches http://pypi.pvt.build.mozilla.org 08:22:28 INFO - proxxy config: {'regions': ['.use1.', '.usw2.', '.scl3'], 'instances': ['proxxy1.srv.releng.use1.mozilla.com', 'proxxy1.srv.releng.usw2.mozilla.com', 'proxxy1.srv.releng.scl3.mozilla.com'], 'urls': [('http://ftp.mozilla.org', 'ftp.mozilla.org'), ('https://ftp.mozilla.org', 'ftp.mozilla.org'), ('https://ftp-ssl.mozilla.org', 'ftp.mozilla.org'), ('http://pypi.pvt.build.mozilla.org', 'pypi.pvt.build.mozilla.org'), ('http://pypi.pub.build.mozilla.org', 'pypi.pub.build.mozilla.org')]} 08:22:28 INFO - http://pypi.pub.build.mozilla.org/pub matches http://pypi.pub.build.mozilla.org 08:22:28 INFO - retry: Calling run_command with args: [['C:\\slave\\test\\build\\venv\\Scripts\\pip', 'install', '--timeout', '120', '--no-index', '--find-links', 'http://pypi.pvt.build.mozilla.org/pub', '--find-links', 'http://pypi.pub.build.mozilla.org/pub', 'functools32==3.2.3-2']], kwargs: {'error_level': 'warning', 'error_list': [{'substr': 'not found or a compiler error:', 'level': 'warning'}, {'regex': <_sre.SRE_Pattern object at 0x00A4EE90>, 'level': 'error'}, {'regex': <_sre.SRE_Pattern object at 0x00ADEA70>, 'level': 'warning'}, {'regex': <_sre.SRE_Pattern object at 0x00C46F80>, 'level': 'debug'}, {'substr': 'command not found', 'level': 'error'}, {'regex': <_sre.SRE_Pattern object at 0x00B99368>, 'level': 'warning'}, {'substr': 'Traceback (most recent call last)', 'level': 'error'}, {'substr': 'SyntaxError: ', 'level': 'error'}, {'substr': 'TypeError: ', 'level': 'error'}, {'substr': 'NameError: ', 'level': 'error'}, {'substr': 'ZeroDivisionError: ', 'level': 'error'}, {'regex': <_sre.SRE_Pattern object at 0x00A7A700>, 'level': 'critical'}, {'regex': <_sre.SRE_Pattern object at 0x00B982A0>, 'level': 'critical'}], 'cwd': 'C:\\slave\\test\\build', 'env': {'TMP': 'C:\\DOCUME~1\\CLTBLD~1.T-X\\LOCALS~1\\Temp', 'MOZILLABUILD': 'D:\\mozilla-build', 'COMPUTERNAME': 'T-XP32-IX-022', 'USERDOMAIN': 'T-XP32-IX-022', 'KTS_VERSION': '1.19c', 'LIBPATH': 'C:\\WINDOWS\\Microsoft.NET\\Framework\\v2.0.50727;D:\\msvs8\\VC\\ATLMFC\\LIB', 'COMMONPROGRAMFILES': 'C:\\Program Files\\Common Files', 'MOZILLABUILDPATH': '\\mozilla-build\\', 'PROCESSOR_IDENTIFIER': 'x86 Family 6 Model 30 Stepping 5, GenuineIntel', 'PROGRAMFILES': 'C:\\Program Files', 'PROCESSOR_REVISION': '1e05', 'DNSSUFFIX': 'wintest.releng.scl3.mozilla.com', 'SYSTEMROOT': 'C:\\WINDOWS', 'NO_EM_RESTART': '1', 'OURDRIVE': 'C:', 'MSVCDIR': 'D:\\msvs8\\VC', 'XPCOM_DEBUG_BREAK': 'warn', 'MONDIR': 'C:\\Monitor_config\\', 'TEMP': 'C:\\DOCUME~1\\CLTBLD~1.T-X\\LOCALS~1\\Temp', 'COMSPEC': 'C:\\WINDOWS\\system32\\cmd.exe', 'RUNLOGFILE': 'C:\\slave\\\\runslave.log', 'PROCESSOR_ARCHITECTURE': 'x86', 'VCVARS': 'D:\\msvs8\\VC\\bin\\vcvars32.bat', 'VSINSTALLDIR': 'D:\\msvs8', 'ALLUSERSPROFILE': 'C:\\Documents and Settings\\All Users', 'MOZILLABUILDDRIVE': 'C:', 'SESSIONNAME': 'Console', 'HOMEPATH': '\\Documents and Settings\\cltbld.T-XP32-IX-022', 'FRAMEWORKDIR': 'C:\\WINDOWS\\Microsoft.NET\\Framework', 'MOZBUILDDIR': 'C:\\mozilla-build\\', 'FRAMEWORKSDKDIR': 'D:\\msvs8\\SDK\\v2.0', 'TEST1': 'testie', 'LOGONSERVER': '\\\\T-XP32-IX-022', 'MOZ_NO_REMOTE': '1', 'MOZ_HIDE_RESULTS_TABLE': '1', 'WINDIR': 'C:\\WINDOWS', 'MOZ_TOOLS': 'D:\\mozilla-build\\moztools', 'PATH': 'C:\\Program Files\\NVIDIA Corporation\\PhysX\\Common;C:\\WINDOWS\\system32;C:\\WINDOWS;C:\\WINDOWS\\System32\\Wbem;C:\\WINDOWS\\system32\\WindowsPowerShell\\v1.0;C:\\mozilla-build\\python27;C:\\mozilla-build\\python27\\Scripts;C:\\mozilla-build\\msys\\bin;C:\\mozilla-build\\vim\\vim72;C:\\mozilla-build\\wget;C:\\mozilla-build\\info-zip;C:\\CoreUtils\\bin;C:\\mozilla-build\\buildbotve\\scripts;C:\\mozilla-build\\hg', 'MOZ_AIRBAG': '1', 'PROMPT': '$P$G', 'USERNAME': 'cltbld', 'NO_FAIL_ON_TEST_ERRORS': '1', 'PATHEXT': '.COM;.EXE;.BAT;.CMD;.VBS;.VBE;.JS;.JSE;.WSF;.WSH;.PSC1', 'FP_NO_HOST_CHECK': 'NO', 'DCLOCATION': 'SCL3', 'APPDATA': 'C:\\Documents and Settings\\cltbld.T-XP32-IX-022\\Application Data', 'HOMEDRIVE': 'C:', 'MOZ_MSVCVERSION': '8', 'FRAMEWORKVERSION': 'v2.0.50727', 'SYSTEMDRIVE': 'C:', 'SLAVEDIR': 'C:\\slave\\', 'NUMBER_OF_PROCESSORS': '8', 'DEVENVDIR': 'D:\\msvs8\\Common7\\IDE', 'PWD': 'C:\\slave\\test', 'PROCESSOR_LEVEL': '6', 'KTS_HOME': 'C:\\Program Files\\KTS', 'PROPERTIES_FILE': 'C:\\slave\\test/buildprops.json', 'MOZ_CRASHREPORTER_NO_REPORT': '1', 'VCINSTALLDIR': 'D:\\msvs8\\VC', 'OS': 'Windows_NT', 'USERPROFILE': 'C:\\Documents and Settings\\cltbld.T-XP32-IX-022'}}, attempt #1 08:22:28 INFO - Running command: ['C:\\slave\\test\\build\\venv\\Scripts\\pip', 'install', '--timeout', '120', '--no-index', '--find-links', 'http://pypi.pvt.build.mozilla.org/pub', '--find-links', 'http://pypi.pub.build.mozilla.org/pub', 'functools32==3.2.3-2'] in C:\slave\test\build 08:22:28 INFO - Copy/paste: C:\slave\test\build\venv\Scripts\pip install --timeout 120 --no-index --find-links http://pypi.pvt.build.mozilla.org/pub --find-links http://pypi.pub.build.mozilla.org/pub functools32==3.2.3-2 08:22:28 INFO - Using env: {'ALLUSERSPROFILE': 'C:\\Documents and Settings\\All Users', 08:22:28 INFO - 'APPDATA': 'C:\\Documents and Settings\\cltbld.T-XP32-IX-022\\Application Data', 08:22:28 INFO - 'COMMONPROGRAMFILES': 'C:\\Program Files\\Common Files', 08:22:28 INFO - 'COMPUTERNAME': 'T-XP32-IX-022', 08:22:28 INFO - 'COMSPEC': 'C:\\WINDOWS\\system32\\cmd.exe', 08:22:28 INFO - 'DCLOCATION': 'SCL3', 08:22:28 INFO - 'DEVENVDIR': 'D:\\msvs8\\Common7\\IDE', 08:22:28 INFO - 'DNSSUFFIX': 'wintest.releng.scl3.mozilla.com', 08:22:28 INFO - 'FP_NO_HOST_CHECK': 'NO', 08:22:28 INFO - 'FRAMEWORKDIR': 'C:\\WINDOWS\\Microsoft.NET\\Framework', 08:22:28 INFO - 'FRAMEWORKSDKDIR': 'D:\\msvs8\\SDK\\v2.0', 08:22:28 INFO - 'FRAMEWORKVERSION': 'v2.0.50727', 08:22:28 INFO - 'HOMEDRIVE': 'C:', 08:22:28 INFO - 'HOMEPATH': '\\Documents and Settings\\cltbld.T-XP32-IX-022', 08:22:28 INFO - 'KTS_HOME': 'C:\\Program Files\\KTS', 08:22:28 INFO - 'KTS_VERSION': '1.19c', 08:22:28 INFO - 'LIBPATH': 'C:\\WINDOWS\\Microsoft.NET\\Framework\\v2.0.50727;D:\\msvs8\\VC\\ATLMFC\\LIB', 08:22:28 INFO - 'LOGONSERVER': '\\\\T-XP32-IX-022', 08:22:28 INFO - 'MONDIR': 'C:\\Monitor_config\\', 08:22:28 INFO - 'MOZBUILDDIR': 'C:\\mozilla-build\\', 08:22:28 INFO - 'MOZILLABUILD': 'D:\\mozilla-build', 08:22:28 INFO - 'MOZILLABUILDDRIVE': 'C:', 08:22:28 INFO - 'MOZILLABUILDPATH': '\\mozilla-build\\', 08:22:28 INFO - 'MOZ_AIRBAG': '1', 08:22:28 INFO - 'MOZ_CRASHREPORTER_NO_REPORT': '1', 08:22:28 INFO - 'MOZ_HIDE_RESULTS_TABLE': '1', 08:22:28 INFO - 'MOZ_MSVCVERSION': '8', 08:22:28 INFO - 'MOZ_NO_REMOTE': '1', 08:22:28 INFO - 'MOZ_TOOLS': 'D:\\mozilla-build\\moztools', 08:22:28 INFO - 'MSVCDIR': 'D:\\msvs8\\VC', 08:22:28 INFO - 'NO_EM_RESTART': '1', 08:22:28 INFO - 'NO_FAIL_ON_TEST_ERRORS': '1', 08:22:28 INFO - 'NUMBER_OF_PROCESSORS': '8', 08:22:28 INFO - 'OS': 'Windows_NT', 08:22:28 INFO - 'OURDRIVE': 'C:', 08:22:28 INFO - 'PATH': 'C:\\Program Files\\NVIDIA Corporation\\PhysX\\Common;C:\\WINDOWS\\system32;C:\\WINDOWS;C:\\WINDOWS\\System32\\Wbem;C:\\WINDOWS\\system32\\WindowsPowerShell\\v1.0;C:\\mozilla-build\\python27;C:\\mozilla-build\\python27\\Scripts;C:\\mozilla-build\\msys\\bin;C:\\mozilla-build\\vim\\vim72;C:\\mozilla-build\\wget;C:\\mozilla-build\\info-zip;C:\\CoreUtils\\bin;C:\\mozilla-build\\buildbotve\\scripts;C:\\mozilla-build\\hg', 08:22:28 INFO - 'PATHEXT': '.COM;.EXE;.BAT;.CMD;.VBS;.VBE;.JS;.JSE;.WSF;.WSH;.PSC1', 08:22:28 INFO - 'PROCESSOR_ARCHITECTURE': 'x86', 08:22:28 INFO - 'PROCESSOR_IDENTIFIER': 'x86 Family 6 Model 30 Stepping 5, GenuineIntel', 08:22:28 INFO - 'PROCESSOR_LEVEL': '6', 08:22:28 INFO - 'PROCESSOR_REVISION': '1e05', 08:22:28 INFO - 'PROGRAMFILES': 'C:\\Program Files', 08:22:28 INFO - 'PROMPT': '$P$G', 08:22:28 INFO - 'PROPERTIES_FILE': 'C:\\slave\\test/buildprops.json', 08:22:28 INFO - 'PWD': 'C:\\slave\\test', 08:22:28 INFO - 'RUNLOGFILE': 'C:\\slave\\\\runslave.log', 08:22:28 INFO - 'SESSIONNAME': 'Console', 08:22:28 INFO - 'SLAVEDIR': 'C:\\slave\\', 08:22:28 INFO - 'SYSTEMDRIVE': 'C:', 08:22:28 INFO - 'SYSTEMROOT': 'C:\\WINDOWS', 08:22:28 INFO - 'TEMP': 'C:\\DOCUME~1\\CLTBLD~1.T-X\\LOCALS~1\\Temp', 08:22:28 INFO - 'TEST1': 'testie', 08:22:28 INFO - 'TMP': 'C:\\DOCUME~1\\CLTBLD~1.T-X\\LOCALS~1\\Temp', 08:22:28 INFO - 'USERDOMAIN': 'T-XP32-IX-022', 08:22:28 INFO - 'USERNAME': 'cltbld', 08:22:28 INFO - 'USERPROFILE': 'C:\\Documents and Settings\\cltbld.T-XP32-IX-022', 08:22:28 INFO - 'VCINSTALLDIR': 'D:\\msvs8\\VC', 08:22:28 INFO - 'VCVARS': 'D:\\msvs8\\VC\\bin\\vcvars32.bat', 08:22:28 INFO - 'VSINSTALLDIR': 'D:\\msvs8', 08:22:28 INFO - 'WINDIR': 'C:\\WINDOWS', 08:22:28 INFO - 'XPCOM_DEBUG_BREAK': 'warn'} 08:22:29 INFO - Ignoring indexes: http://pypi.python.org/simple/ 08:22:29 INFO - Downloading/unpacking functools32==3.2.3-2 08:22:29 INFO - Downloading functools32-3.2.3-2.tar.gz 08:22:29 INFO - Running setup.py egg_info for package functools32 08:22:29 INFO - warning: no files found matching '*.txt' 08:22:29 INFO - no previously-included directories found matching 'build' 08:22:29 INFO - no previously-included directories found matching 'dist' 08:22:29 INFO - no previously-included directories found matching '.git*' 08:22:29 INFO - Installing collected packages: functools32 08:22:29 INFO - Running setup.py install for functools32 08:22:29 INFO - warning: no files found matching '*.txt' 08:22:29 INFO - no previously-included directories found matching 'build' 08:22:29 INFO - no previously-included directories found matching 'dist' 08:22:29 INFO - no previously-included directories found matching '.git*' 08:22:29 INFO - Successfully installed functools32 08:22:29 INFO - Cleaning up... 08:22:29 INFO - Return code: 0 08:22:29 INFO - Installing blobuploader==1.2.4 into virtualenv C:\slave\test\build\venv 08:22:29 INFO - proxxy config: {'regions': ['.use1.', '.usw2.', '.scl3'], 'instances': ['proxxy1.srv.releng.use1.mozilla.com', 'proxxy1.srv.releng.usw2.mozilla.com', 'proxxy1.srv.releng.scl3.mozilla.com'], 'urls': [('http://ftp.mozilla.org', 'ftp.mozilla.org'), ('https://ftp.mozilla.org', 'ftp.mozilla.org'), ('https://ftp-ssl.mozilla.org', 'ftp.mozilla.org'), ('http://pypi.pvt.build.mozilla.org', 'pypi.pvt.build.mozilla.org'), ('http://pypi.pub.build.mozilla.org', 'pypi.pub.build.mozilla.org')]} 08:22:29 INFO - http://pypi.pvt.build.mozilla.org/pub matches http://pypi.pvt.build.mozilla.org 08:22:29 INFO - proxxy config: {'regions': ['.use1.', '.usw2.', '.scl3'], 'instances': ['proxxy1.srv.releng.use1.mozilla.com', 'proxxy1.srv.releng.usw2.mozilla.com', 'proxxy1.srv.releng.scl3.mozilla.com'], 'urls': [('http://ftp.mozilla.org', 'ftp.mozilla.org'), ('https://ftp.mozilla.org', 'ftp.mozilla.org'), ('https://ftp-ssl.mozilla.org', 'ftp.mozilla.org'), ('http://pypi.pvt.build.mozilla.org', 'pypi.pvt.build.mozilla.org'), ('http://pypi.pub.build.mozilla.org', 'pypi.pub.build.mozilla.org')]} 08:22:29 INFO - http://pypi.pub.build.mozilla.org/pub matches http://pypi.pub.build.mozilla.org 08:22:29 INFO - retry: Calling run_command with args: [['C:\\slave\\test\\build\\venv\\Scripts\\pip', 'install', '--timeout', '120', '--no-index', '--find-links', 'http://pypi.pvt.build.mozilla.org/pub', '--find-links', 'http://pypi.pub.build.mozilla.org/pub', 'blobuploader==1.2.4']], kwargs: {'error_level': 'warning', 'error_list': [{'substr': 'not found or a compiler error:', 'level': 'warning'}, {'regex': <_sre.SRE_Pattern object at 0x00A4EE90>, 'level': 'error'}, {'regex': <_sre.SRE_Pattern object at 0x00ADEA70>, 'level': 'warning'}, {'regex': <_sre.SRE_Pattern object at 0x00C46F80>, 'level': 'debug'}, {'substr': 'command not found', 'level': 'error'}, {'regex': <_sre.SRE_Pattern object at 0x00B99368>, 'level': 'warning'}, {'substr': 'Traceback (most recent call last)', 'level': 'error'}, {'substr': 'SyntaxError: ', 'level': 'error'}, {'substr': 'TypeError: ', 'level': 'error'}, {'substr': 'NameError: ', 'level': 'error'}, {'substr': 'ZeroDivisionError: ', 'level': 'error'}, {'regex': <_sre.SRE_Pattern object at 0x00A7A700>, 'level': 'critical'}, {'regex': <_sre.SRE_Pattern object at 0x00B982A0>, 'level': 'critical'}], 'cwd': 'C:\\slave\\test\\build', 'env': {'TMP': 'C:\\DOCUME~1\\CLTBLD~1.T-X\\LOCALS~1\\Temp', 'MOZILLABUILD': 'D:\\mozilla-build', 'COMPUTERNAME': 'T-XP32-IX-022', 'USERDOMAIN': 'T-XP32-IX-022', 'KTS_VERSION': '1.19c', 'LIBPATH': 'C:\\WINDOWS\\Microsoft.NET\\Framework\\v2.0.50727;D:\\msvs8\\VC\\ATLMFC\\LIB', 'COMMONPROGRAMFILES': 'C:\\Program Files\\Common Files', 'MOZILLABUILDPATH': '\\mozilla-build\\', 'PROCESSOR_IDENTIFIER': 'x86 Family 6 Model 30 Stepping 5, GenuineIntel', 'PROGRAMFILES': 'C:\\Program Files', 'PROCESSOR_REVISION': '1e05', 'DNSSUFFIX': 'wintest.releng.scl3.mozilla.com', 'SYSTEMROOT': 'C:\\WINDOWS', 'NO_EM_RESTART': '1', 'OURDRIVE': 'C:', 'MSVCDIR': 'D:\\msvs8\\VC', 'XPCOM_DEBUG_BREAK': 'warn', 'MONDIR': 'C:\\Monitor_config\\', 'TEMP': 'C:\\DOCUME~1\\CLTBLD~1.T-X\\LOCALS~1\\Temp', 'COMSPEC': 'C:\\WINDOWS\\system32\\cmd.exe', 'RUNLOGFILE': 'C:\\slave\\\\runslave.log', 'PROCESSOR_ARCHITECTURE': 'x86', 'VCVARS': 'D:\\msvs8\\VC\\bin\\vcvars32.bat', 'VSINSTALLDIR': 'D:\\msvs8', 'ALLUSERSPROFILE': 'C:\\Documents and Settings\\All Users', 'MOZILLABUILDDRIVE': 'C:', 'SESSIONNAME': 'Console', 'HOMEPATH': '\\Documents and Settings\\cltbld.T-XP32-IX-022', 'FRAMEWORKDIR': 'C:\\WINDOWS\\Microsoft.NET\\Framework', 'MOZBUILDDIR': 'C:\\mozilla-build\\', 'FRAMEWORKSDKDIR': 'D:\\msvs8\\SDK\\v2.0', 'TEST1': 'testie', 'LOGONSERVER': '\\\\T-XP32-IX-022', 'MOZ_NO_REMOTE': '1', 'MOZ_HIDE_RESULTS_TABLE': '1', 'WINDIR': 'C:\\WINDOWS', 'MOZ_TOOLS': 'D:\\mozilla-build\\moztools', 'PATH': 'C:\\Program Files\\NVIDIA Corporation\\PhysX\\Common;C:\\WINDOWS\\system32;C:\\WINDOWS;C:\\WINDOWS\\System32\\Wbem;C:\\WINDOWS\\system32\\WindowsPowerShell\\v1.0;C:\\mozilla-build\\python27;C:\\mozilla-build\\python27\\Scripts;C:\\mozilla-build\\msys\\bin;C:\\mozilla-build\\vim\\vim72;C:\\mozilla-build\\wget;C:\\mozilla-build\\info-zip;C:\\CoreUtils\\bin;C:\\mozilla-build\\buildbotve\\scripts;C:\\mozilla-build\\hg', 'MOZ_AIRBAG': '1', 'PROMPT': '$P$G', 'USERNAME': 'cltbld', 'NO_FAIL_ON_TEST_ERRORS': '1', 'PATHEXT': '.COM;.EXE;.BAT;.CMD;.VBS;.VBE;.JS;.JSE;.WSF;.WSH;.PSC1', 'FP_NO_HOST_CHECK': 'NO', 'DCLOCATION': 'SCL3', 'APPDATA': 'C:\\Documents and Settings\\cltbld.T-XP32-IX-022\\Application Data', 'HOMEDRIVE': 'C:', 'MOZ_MSVCVERSION': '8', 'FRAMEWORKVERSION': 'v2.0.50727', 'SYSTEMDRIVE': 'C:', 'SLAVEDIR': 'C:\\slave\\', 'NUMBER_OF_PROCESSORS': '8', 'DEVENVDIR': 'D:\\msvs8\\Common7\\IDE', 'PWD': 'C:\\slave\\test', 'PROCESSOR_LEVEL': '6', 'KTS_HOME': 'C:\\Program Files\\KTS', 'PROPERTIES_FILE': 'C:\\slave\\test/buildprops.json', 'MOZ_CRASHREPORTER_NO_REPORT': '1', 'VCINSTALLDIR': 'D:\\msvs8\\VC', 'OS': 'Windows_NT', 'USERPROFILE': 'C:\\Documents and Settings\\cltbld.T-XP32-IX-022'}}, attempt #1 08:22:29 INFO - Running command: ['C:\\slave\\test\\build\\venv\\Scripts\\pip', 'install', '--timeout', '120', '--no-index', '--find-links', 'http://pypi.pvt.build.mozilla.org/pub', '--find-links', 'http://pypi.pub.build.mozilla.org/pub', 'blobuploader==1.2.4'] in C:\slave\test\build 08:22:29 INFO - Copy/paste: C:\slave\test\build\venv\Scripts\pip install --timeout 120 --no-index --find-links http://pypi.pvt.build.mozilla.org/pub --find-links http://pypi.pub.build.mozilla.org/pub blobuploader==1.2.4 08:22:29 INFO - Using env: {'ALLUSERSPROFILE': 'C:\\Documents and Settings\\All Users', 08:22:29 INFO - 'APPDATA': 'C:\\Documents and Settings\\cltbld.T-XP32-IX-022\\Application Data', 08:22:29 INFO - 'COMMONPROGRAMFILES': 'C:\\Program Files\\Common Files', 08:22:29 INFO - 'COMPUTERNAME': 'T-XP32-IX-022', 08:22:29 INFO - 'COMSPEC': 'C:\\WINDOWS\\system32\\cmd.exe', 08:22:29 INFO - 'DCLOCATION': 'SCL3', 08:22:29 INFO - 'DEVENVDIR': 'D:\\msvs8\\Common7\\IDE', 08:22:29 INFO - 'DNSSUFFIX': 'wintest.releng.scl3.mozilla.com', 08:22:29 INFO - 'FP_NO_HOST_CHECK': 'NO', 08:22:29 INFO - 'FRAMEWORKDIR': 'C:\\WINDOWS\\Microsoft.NET\\Framework', 08:22:29 INFO - 'FRAMEWORKSDKDIR': 'D:\\msvs8\\SDK\\v2.0', 08:22:29 INFO - 'FRAMEWORKVERSION': 'v2.0.50727', 08:22:29 INFO - 'HOMEDRIVE': 'C:', 08:22:29 INFO - 'HOMEPATH': '\\Documents and Settings\\cltbld.T-XP32-IX-022', 08:22:29 INFO - 'KTS_HOME': 'C:\\Program Files\\KTS', 08:22:29 INFO - 'KTS_VERSION': '1.19c', 08:22:29 INFO - 'LIBPATH': 'C:\\WINDOWS\\Microsoft.NET\\Framework\\v2.0.50727;D:\\msvs8\\VC\\ATLMFC\\LIB', 08:22:29 INFO - 'LOGONSERVER': '\\\\T-XP32-IX-022', 08:22:29 INFO - 'MONDIR': 'C:\\Monitor_config\\', 08:22:29 INFO - 'MOZBUILDDIR': 'C:\\mozilla-build\\', 08:22:29 INFO - 'MOZILLABUILD': 'D:\\mozilla-build', 08:22:29 INFO - 'MOZILLABUILDDRIVE': 'C:', 08:22:29 INFO - 'MOZILLABUILDPATH': '\\mozilla-build\\', 08:22:29 INFO - 'MOZ_AIRBAG': '1', 08:22:29 INFO - 'MOZ_CRASHREPORTER_NO_REPORT': '1', 08:22:29 INFO - 'MOZ_HIDE_RESULTS_TABLE': '1', 08:22:29 INFO - 'MOZ_MSVCVERSION': '8', 08:22:29 INFO - 'MOZ_NO_REMOTE': '1', 08:22:29 INFO - 'MOZ_TOOLS': 'D:\\mozilla-build\\moztools', 08:22:29 INFO - 'MSVCDIR': 'D:\\msvs8\\VC', 08:22:29 INFO - 'NO_EM_RESTART': '1', 08:22:29 INFO - 'NO_FAIL_ON_TEST_ERRORS': '1', 08:22:29 INFO - 'NUMBER_OF_PROCESSORS': '8', 08:22:29 INFO - 'OS': 'Windows_NT', 08:22:29 INFO - 'OURDRIVE': 'C:', 08:22:29 INFO - 'PATH': 'C:\\Program Files\\NVIDIA Corporation\\PhysX\\Common;C:\\WINDOWS\\system32;C:\\WINDOWS;C:\\WINDOWS\\System32\\Wbem;C:\\WINDOWS\\system32\\WindowsPowerShell\\v1.0;C:\\mozilla-build\\python27;C:\\mozilla-build\\python27\\Scripts;C:\\mozilla-build\\msys\\bin;C:\\mozilla-build\\vim\\vim72;C:\\mozilla-build\\wget;C:\\mozilla-build\\info-zip;C:\\CoreUtils\\bin;C:\\mozilla-build\\buildbotve\\scripts;C:\\mozilla-build\\hg', 08:22:29 INFO - 'PATHEXT': '.COM;.EXE;.BAT;.CMD;.VBS;.VBE;.JS;.JSE;.WSF;.WSH;.PSC1', 08:22:29 INFO - 'PROCESSOR_ARCHITECTURE': 'x86', 08:22:29 INFO - 'PROCESSOR_IDENTIFIER': 'x86 Family 6 Model 30 Stepping 5, GenuineIntel', 08:22:29 INFO - 'PROCESSOR_LEVEL': '6', 08:22:29 INFO - 'PROCESSOR_REVISION': '1e05', 08:22:29 INFO - 'PROGRAMFILES': 'C:\\Program Files', 08:22:29 INFO - 'PROMPT': '$P$G', 08:22:29 INFO - 'PROPERTIES_FILE': 'C:\\slave\\test/buildprops.json', 08:22:29 INFO - 'PWD': 'C:\\slave\\test', 08:22:29 INFO - 'RUNLOGFILE': 'C:\\slave\\\\runslave.log', 08:22:29 INFO - 'SESSIONNAME': 'Console', 08:22:29 INFO - 'SLAVEDIR': 'C:\\slave\\', 08:22:29 INFO - 'SYSTEMDRIVE': 'C:', 08:22:29 INFO - 'SYSTEMROOT': 'C:\\WINDOWS', 08:22:29 INFO - 'TEMP': 'C:\\DOCUME~1\\CLTBLD~1.T-X\\LOCALS~1\\Temp', 08:22:29 INFO - 'TEST1': 'testie', 08:22:29 INFO - 'TMP': 'C:\\DOCUME~1\\CLTBLD~1.T-X\\LOCALS~1\\Temp', 08:22:29 INFO - 'USERDOMAIN': 'T-XP32-IX-022', 08:22:29 INFO - 'USERNAME': 'cltbld', 08:22:29 INFO - 'USERPROFILE': 'C:\\Documents and Settings\\cltbld.T-XP32-IX-022', 08:22:29 INFO - 'VCINSTALLDIR': 'D:\\msvs8\\VC', 08:22:29 INFO - 'VCVARS': 'D:\\msvs8\\VC\\bin\\vcvars32.bat', 08:22:29 INFO - 'VSINSTALLDIR': 'D:\\msvs8', 08:22:29 INFO - 'WINDIR': 'C:\\WINDOWS', 08:22:29 INFO - 'XPCOM_DEBUG_BREAK': 'warn'} 08:22:30 INFO - Ignoring indexes: http://pypi.python.org/simple/ 08:22:30 INFO - Downloading/unpacking blobuploader==1.2.4 08:22:30 INFO - Downloading blobuploader-1.2.4.tar.gz 08:22:30 INFO - Running setup.py egg_info for package blobuploader 08:22:30 INFO - Downloading/unpacking requests==1.2.3. (from blobuploader==1.2.4) 08:22:32 INFO - Running setup.py egg_info for package requests 08:22:32 INFO - Downloading/unpacking docopt==0.6.1 (from blobuploader==1.2.4) 08:22:32 INFO - Downloading docopt-0.6.1.tar.gz 08:22:32 INFO - Running setup.py egg_info for package docopt 08:22:32 INFO - Installing collected packages: blobuploader, docopt, requests 08:22:32 INFO - Running setup.py install for blobuploader 08:22:32 INFO - Running setup.py install for docopt 08:22:32 INFO - Running setup.py install for requests 08:22:32 INFO - Successfully installed blobuploader docopt requests 08:22:32 INFO - Cleaning up... 08:22:32 INFO - Return code: 0 08:22:32 INFO - Installing None into virtualenv C:\slave\test\build\venv 08:22:32 INFO - proxxy config: {'regions': ['.use1.', '.usw2.', '.scl3'], 'instances': ['proxxy1.srv.releng.use1.mozilla.com', 'proxxy1.srv.releng.usw2.mozilla.com', 'proxxy1.srv.releng.scl3.mozilla.com'], 'urls': [('http://ftp.mozilla.org', 'ftp.mozilla.org'), ('https://ftp.mozilla.org', 'ftp.mozilla.org'), ('https://ftp-ssl.mozilla.org', 'ftp.mozilla.org'), ('http://pypi.pvt.build.mozilla.org', 'pypi.pvt.build.mozilla.org'), ('http://pypi.pub.build.mozilla.org', 'pypi.pub.build.mozilla.org')]} 08:22:32 INFO - http://pypi.pvt.build.mozilla.org/pub matches http://pypi.pvt.build.mozilla.org 08:22:32 INFO - proxxy config: {'regions': ['.use1.', '.usw2.', '.scl3'], 'instances': ['proxxy1.srv.releng.use1.mozilla.com', 'proxxy1.srv.releng.usw2.mozilla.com', 'proxxy1.srv.releng.scl3.mozilla.com'], 'urls': [('http://ftp.mozilla.org', 'ftp.mozilla.org'), ('https://ftp.mozilla.org', 'ftp.mozilla.org'), ('https://ftp-ssl.mozilla.org', 'ftp.mozilla.org'), ('http://pypi.pvt.build.mozilla.org', 'pypi.pvt.build.mozilla.org'), ('http://pypi.pub.build.mozilla.org', 'pypi.pub.build.mozilla.org')]} 08:22:32 INFO - http://pypi.pub.build.mozilla.org/pub matches http://pypi.pub.build.mozilla.org 08:22:32 INFO - retry: Calling run_command with args: [['C:\\slave\\test\\build\\venv\\Scripts\\pip', 'install', '--no-deps', '--timeout', '120', '-r', 'C:\\slave\\test\\build\\tests\\config\\marionette_requirements.txt', '--no-index', '--find-links', 'http://pypi.pvt.build.mozilla.org/pub', '--find-links', 'http://pypi.pub.build.mozilla.org/pub']], kwargs: {'error_level': 'warning', 'error_list': [{'substr': 'not found or a compiler error:', 'level': 'warning'}, {'regex': <_sre.SRE_Pattern object at 0x00A4EE90>, 'level': 'error'}, {'regex': <_sre.SRE_Pattern object at 0x00ADEA70>, 'level': 'warning'}, {'regex': <_sre.SRE_Pattern object at 0x00C46F80>, 'level': 'debug'}, {'substr': 'command not found', 'level': 'error'}, {'regex': <_sre.SRE_Pattern object at 0x00B99368>, 'level': 'warning'}, {'substr': 'Traceback (most recent call last)', 'level': 'error'}, {'substr': 'SyntaxError: ', 'level': 'error'}, {'substr': 'TypeError: ', 'level': 'error'}, {'substr': 'NameError: ', 'level': 'error'}, {'substr': 'ZeroDivisionError: ', 'level': 'error'}, {'regex': <_sre.SRE_Pattern object at 0x00A7A700>, 'level': 'critical'}, {'regex': <_sre.SRE_Pattern object at 0x00B982A0>, 'level': 'critical'}], 'cwd': 'C:\\slave\\test\\build\\tests\\config', 'env': {'TMP': 'C:\\DOCUME~1\\CLTBLD~1.T-X\\LOCALS~1\\Temp', 'MOZILLABUILD': 'D:\\mozilla-build', 'COMPUTERNAME': 'T-XP32-IX-022', 'USERDOMAIN': 'T-XP32-IX-022', 'KTS_VERSION': '1.19c', 'LIBPATH': 'C:\\WINDOWS\\Microsoft.NET\\Framework\\v2.0.50727;D:\\msvs8\\VC\\ATLMFC\\LIB', 'COMMONPROGRAMFILES': 'C:\\Program Files\\Common Files', 'MOZILLABUILDPATH': '\\mozilla-build\\', 'PROCESSOR_IDENTIFIER': 'x86 Family 6 Model 30 Stepping 5, GenuineIntel', 'PROGRAMFILES': 'C:\\Program Files', 'PROCESSOR_REVISION': '1e05', 'DNSSUFFIX': 'wintest.releng.scl3.mozilla.com', 'SYSTEMROOT': 'C:\\WINDOWS', 'NO_EM_RESTART': '1', 'OURDRIVE': 'C:', 'MSVCDIR': 'D:\\msvs8\\VC', 'XPCOM_DEBUG_BREAK': 'warn', 'MONDIR': 'C:\\Monitor_config\\', 'TEMP': 'C:\\DOCUME~1\\CLTBLD~1.T-X\\LOCALS~1\\Temp', 'COMSPEC': 'C:\\WINDOWS\\system32\\cmd.exe', 'RUNLOGFILE': 'C:\\slave\\\\runslave.log', 'PROCESSOR_ARCHITECTURE': 'x86', 'VCVARS': 'D:\\msvs8\\VC\\bin\\vcvars32.bat', 'VSINSTALLDIR': 'D:\\msvs8', 'ALLUSERSPROFILE': 'C:\\Documents and Settings\\All Users', 'MOZILLABUILDDRIVE': 'C:', 'SESSIONNAME': 'Console', 'HOMEPATH': '\\Documents and Settings\\cltbld.T-XP32-IX-022', 'FRAMEWORKDIR': 'C:\\WINDOWS\\Microsoft.NET\\Framework', 'MOZBUILDDIR': 'C:\\mozilla-build\\', 'FRAMEWORKSDKDIR': 'D:\\msvs8\\SDK\\v2.0', 'TEST1': 'testie', 'LOGONSERVER': '\\\\T-XP32-IX-022', 'MOZ_NO_REMOTE': '1', 'MOZ_HIDE_RESULTS_TABLE': '1', 'WINDIR': 'C:\\WINDOWS', 'MOZ_TOOLS': 'D:\\mozilla-build\\moztools', 'PATH': 'C:\\Program Files\\NVIDIA Corporation\\PhysX\\Common;C:\\WINDOWS\\system32;C:\\WINDOWS;C:\\WINDOWS\\System32\\Wbem;C:\\WINDOWS\\system32\\WindowsPowerShell\\v1.0;C:\\mozilla-build\\python27;C:\\mozilla-build\\python27\\Scripts;C:\\mozilla-build\\msys\\bin;C:\\mozilla-build\\vim\\vim72;C:\\mozilla-build\\wget;C:\\mozilla-build\\info-zip;C:\\CoreUtils\\bin;C:\\mozilla-build\\buildbotve\\scripts;C:\\mozilla-build\\hg', 'MOZ_AIRBAG': '1', 'PROMPT': '$P$G', 'USERNAME': 'cltbld', 'NO_FAIL_ON_TEST_ERRORS': '1', 'PATHEXT': '.COM;.EXE;.BAT;.CMD;.VBS;.VBE;.JS;.JSE;.WSF;.WSH;.PSC1', 'FP_NO_HOST_CHECK': 'NO', 'DCLOCATION': 'SCL3', 'APPDATA': 'C:\\Documents and Settings\\cltbld.T-XP32-IX-022\\Application Data', 'HOMEDRIVE': 'C:', 'MOZ_MSVCVERSION': '8', 'FRAMEWORKVERSION': 'v2.0.50727', 'SYSTEMDRIVE': 'C:', 'SLAVEDIR': 'C:\\slave\\', 'NUMBER_OF_PROCESSORS': '8', 'DEVENVDIR': 'D:\\msvs8\\Common7\\IDE', 'PWD': 'C:\\slave\\test', 'PROCESSOR_LEVEL': '6', 'KTS_HOME': 'C:\\Program Files\\KTS', 'PROPERTIES_FILE': 'C:\\slave\\test/buildprops.json', 'MOZ_CRASHREPORTER_NO_REPORT': '1', 'VCINSTALLDIR': 'D:\\msvs8\\VC', 'OS': 'Windows_NT', 'USERPROFILE': 'C:\\Documents and Settings\\cltbld.T-XP32-IX-022'}}, attempt #1 08:22:32 INFO - Running command: ['C:\\slave\\test\\build\\venv\\Scripts\\pip', 'install', '--no-deps', '--timeout', '120', '-r', 'C:\\slave\\test\\build\\tests\\config\\marionette_requirements.txt', '--no-index', '--find-links', 'http://pypi.pvt.build.mozilla.org/pub', '--find-links', 'http://pypi.pub.build.mozilla.org/pub'] in C:\slave\test\build\tests\config 08:22:32 INFO - Copy/paste: C:\slave\test\build\venv\Scripts\pip install --no-deps --timeout 120 -r C:\slave\test\build\tests\config\marionette_requirements.txt --no-index --find-links http://pypi.pvt.build.mozilla.org/pub --find-links http://pypi.pub.build.mozilla.org/pub 08:22:32 INFO - Using env: {'ALLUSERSPROFILE': 'C:\\Documents and Settings\\All Users', 08:22:32 INFO - 'APPDATA': 'C:\\Documents and Settings\\cltbld.T-XP32-IX-022\\Application Data', 08:22:32 INFO - 'COMMONPROGRAMFILES': 'C:\\Program Files\\Common Files', 08:22:32 INFO - 'COMPUTERNAME': 'T-XP32-IX-022', 08:22:32 INFO - 'COMSPEC': 'C:\\WINDOWS\\system32\\cmd.exe', 08:22:32 INFO - 'DCLOCATION': 'SCL3', 08:22:32 INFO - 'DEVENVDIR': 'D:\\msvs8\\Common7\\IDE', 08:22:32 INFO - 'DNSSUFFIX': 'wintest.releng.scl3.mozilla.com', 08:22:32 INFO - 'FP_NO_HOST_CHECK': 'NO', 08:22:32 INFO - 'FRAMEWORKDIR': 'C:\\WINDOWS\\Microsoft.NET\\Framework', 08:22:32 INFO - 'FRAMEWORKSDKDIR': 'D:\\msvs8\\SDK\\v2.0', 08:22:32 INFO - 'FRAMEWORKVERSION': 'v2.0.50727', 08:22:32 INFO - 'HOMEDRIVE': 'C:', 08:22:32 INFO - 'HOMEPATH': '\\Documents and Settings\\cltbld.T-XP32-IX-022', 08:22:32 INFO - 'KTS_HOME': 'C:\\Program Files\\KTS', 08:22:32 INFO - 'KTS_VERSION': '1.19c', 08:22:32 INFO - 'LIBPATH': 'C:\\WINDOWS\\Microsoft.NET\\Framework\\v2.0.50727;D:\\msvs8\\VC\\ATLMFC\\LIB', 08:22:32 INFO - 'LOGONSERVER': '\\\\T-XP32-IX-022', 08:22:32 INFO - 'MONDIR': 'C:\\Monitor_config\\', 08:22:32 INFO - 'MOZBUILDDIR': 'C:\\mozilla-build\\', 08:22:32 INFO - 'MOZILLABUILD': 'D:\\mozilla-build', 08:22:32 INFO - 'MOZILLABUILDDRIVE': 'C:', 08:22:32 INFO - 'MOZILLABUILDPATH': '\\mozilla-build\\', 08:22:32 INFO - 'MOZ_AIRBAG': '1', 08:22:32 INFO - 'MOZ_CRASHREPORTER_NO_REPORT': '1', 08:22:32 INFO - 'MOZ_HIDE_RESULTS_TABLE': '1', 08:22:32 INFO - 'MOZ_MSVCVERSION': '8', 08:22:32 INFO - 'MOZ_NO_REMOTE': '1', 08:22:32 INFO - 'MOZ_TOOLS': 'D:\\mozilla-build\\moztools', 08:22:32 INFO - 'MSVCDIR': 'D:\\msvs8\\VC', 08:22:32 INFO - 'NO_EM_RESTART': '1', 08:22:32 INFO - 'NO_FAIL_ON_TEST_ERRORS': '1', 08:22:32 INFO - 'NUMBER_OF_PROCESSORS': '8', 08:22:32 INFO - 'OS': 'Windows_NT', 08:22:32 INFO - 'OURDRIVE': 'C:', 08:22:32 INFO - 'PATH': 'C:\\Program Files\\NVIDIA Corporation\\PhysX\\Common;C:\\WINDOWS\\system32;C:\\WINDOWS;C:\\WINDOWS\\System32\\Wbem;C:\\WINDOWS\\system32\\WindowsPowerShell\\v1.0;C:\\mozilla-build\\python27;C:\\mozilla-build\\python27\\Scripts;C:\\mozilla-build\\msys\\bin;C:\\mozilla-build\\vim\\vim72;C:\\mozilla-build\\wget;C:\\mozilla-build\\info-zip;C:\\CoreUtils\\bin;C:\\mozilla-build\\buildbotve\\scripts;C:\\mozilla-build\\hg', 08:22:32 INFO - 'PATHEXT': '.COM;.EXE;.BAT;.CMD;.VBS;.VBE;.JS;.JSE;.WSF;.WSH;.PSC1', 08:22:32 INFO - 'PROCESSOR_ARCHITECTURE': 'x86', 08:22:32 INFO - 'PROCESSOR_IDENTIFIER': 'x86 Family 6 Model 30 Stepping 5, GenuineIntel', 08:22:32 INFO - 'PROCESSOR_LEVEL': '6', 08:22:32 INFO - 'PROCESSOR_REVISION': '1e05', 08:22:32 INFO - 'PROGRAMFILES': 'C:\\Program Files', 08:22:32 INFO - 'PROMPT': '$P$G', 08:22:32 INFO - 'PROPERTIES_FILE': 'C:\\slave\\test/buildprops.json', 08:22:32 INFO - 'PWD': 'C:\\slave\\test', 08:22:32 INFO - 'RUNLOGFILE': 'C:\\slave\\\\runslave.log', 08:22:32 INFO - 'SESSIONNAME': 'Console', 08:22:32 INFO - 'SLAVEDIR': 'C:\\slave\\', 08:22:32 INFO - 'SYSTEMDRIVE': 'C:', 08:22:32 INFO - 'SYSTEMROOT': 'C:\\WINDOWS', 08:22:32 INFO - 'TEMP': 'C:\\DOCUME~1\\CLTBLD~1.T-X\\LOCALS~1\\Temp', 08:22:32 INFO - 'TEST1': 'testie', 08:22:32 INFO - 'TMP': 'C:\\DOCUME~1\\CLTBLD~1.T-X\\LOCALS~1\\Temp', 08:22:32 INFO - 'USERDOMAIN': 'T-XP32-IX-022', 08:22:32 INFO - 'USERNAME': 'cltbld', 08:22:32 INFO - 'USERPROFILE': 'C:\\Documents and Settings\\cltbld.T-XP32-IX-022', 08:22:32 INFO - 'VCINSTALLDIR': 'D:\\msvs8\\VC', 08:22:32 INFO - 'VCVARS': 'D:\\msvs8\\VC\\bin\\vcvars32.bat', 08:22:32 INFO - 'VSINSTALLDIR': 'D:\\msvs8', 08:22:32 INFO - 'WINDIR': 'C:\\WINDOWS', 08:22:32 INFO - 'XPCOM_DEBUG_BREAK': 'warn'} 08:22:37 INFO - Ignoring indexes: http://pypi.python.org/simple/ 08:22:37 INFO - Unpacking c:\slave\test\build\tests\mozbase\manifestparser 08:22:37 INFO - Running setup.py egg_info for package from file:///c%7C%5Cslave%5Ctest%5Cbuild%5Ctests%5Cmozbase%5Cmanifestparser 08:22:37 INFO - Unpacking c:\slave\test\build\tests\mozbase\mozcrash 08:22:37 INFO - Running setup.py egg_info for package from file:///c%7C%5Cslave%5Ctest%5Cbuild%5Ctests%5Cmozbase%5Cmozcrash 08:22:37 INFO - Unpacking c:\slave\test\build\tests\mozbase\mozdebug 08:22:37 INFO - Running setup.py egg_info for package from file:///c%7C%5Cslave%5Ctest%5Cbuild%5Ctests%5Cmozbase%5Cmozdebug 08:22:37 INFO - Unpacking c:\slave\test\build\tests\mozbase\mozdevice 08:22:37 INFO - Running setup.py egg_info for package from file:///c%7C%5Cslave%5Ctest%5Cbuild%5Ctests%5Cmozbase%5Cmozdevice 08:22:37 INFO - Unpacking c:\slave\test\build\tests\mozbase\mozfile 08:22:37 INFO - Running setup.py egg_info for package from file:///c%7C%5Cslave%5Ctest%5Cbuild%5Ctests%5Cmozbase%5Cmozfile 08:22:37 INFO - Unpacking c:\slave\test\build\tests\mozbase\mozhttpd 08:22:37 INFO - Running setup.py egg_info for package from file:///c%7C%5Cslave%5Ctest%5Cbuild%5Ctests%5Cmozbase%5Cmozhttpd 08:22:37 INFO - Unpacking c:\slave\test\build\tests\mozbase\mozinfo 08:22:37 INFO - Running setup.py egg_info for package from file:///c%7C%5Cslave%5Ctest%5Cbuild%5Ctests%5Cmozbase%5Cmozinfo 08:22:37 INFO - Unpacking c:\slave\test\build\tests\mozbase\mozinstall 08:22:37 INFO - Running setup.py egg_info for package from file:///c%7C%5Cslave%5Ctest%5Cbuild%5Ctests%5Cmozbase%5Cmozinstall 08:22:37 INFO - Unpacking c:\slave\test\build\tests\mozbase\mozleak 08:22:37 INFO - Running setup.py egg_info for package from file:///c%7C%5Cslave%5Ctest%5Cbuild%5Ctests%5Cmozbase%5Cmozleak 08:22:37 INFO - Unpacking c:\slave\test\build\tests\mozbase\mozlog 08:22:37 INFO - Running setup.py egg_info for package from file:///c%7C%5Cslave%5Ctest%5Cbuild%5Ctests%5Cmozbase%5Cmozlog 08:22:37 INFO - Unpacking c:\slave\test\build\tests\mozbase\moznetwork 08:22:37 INFO - Running setup.py egg_info for package from file:///c%7C%5Cslave%5Ctest%5Cbuild%5Ctests%5Cmozbase%5Cmoznetwork 08:22:37 INFO - Unpacking c:\slave\test\build\tests\mozbase\mozprocess 08:22:37 INFO - Running setup.py egg_info for package from file:///c%7C%5Cslave%5Ctest%5Cbuild%5Ctests%5Cmozbase%5Cmozprocess 08:22:37 INFO - Unpacking c:\slave\test\build\tests\mozbase\mozprofile 08:22:37 INFO - Running setup.py egg_info for package from file:///c%7C%5Cslave%5Ctest%5Cbuild%5Ctests%5Cmozbase%5Cmozprofile 08:22:37 INFO - Unpacking c:\slave\test\build\tests\mozbase\mozrunner 08:22:37 INFO - Running setup.py egg_info for package from file:///c%7C%5Cslave%5Ctest%5Cbuild%5Ctests%5Cmozbase%5Cmozrunner 08:22:37 INFO - Unpacking c:\slave\test\build\tests\mozbase\mozscreenshot 08:22:37 INFO - Running setup.py egg_info for package from file:///c%7C%5Cslave%5Ctest%5Cbuild%5Ctests%5Cmozbase%5Cmozscreenshot 08:22:37 INFO - Unpacking c:\slave\test\build\tests\mozbase\moztest 08:22:37 INFO - Running setup.py egg_info for package from file:///c%7C%5Cslave%5Ctest%5Cbuild%5Ctests%5Cmozbase%5Cmoztest 08:22:37 INFO - Unpacking c:\slave\test\build\tests\mozbase\mozversion 08:22:37 INFO - Running setup.py egg_info for package from file:///c%7C%5Cslave%5Ctest%5Cbuild%5Ctests%5Cmozbase%5Cmozversion 08:22:37 INFO - Unpacking c:\slave\test\build\tests\tools\wptserve 08:22:37 INFO - Running setup.py egg_info for package from file:///c%7C%5Cslave%5Ctest%5Cbuild%5Ctests%5Ctools%5Cwptserve 08:22:37 INFO - Unpacking c:\slave\test\build\tests\marionette\client 08:22:37 INFO - Running setup.py egg_info for package from file:///c%7C%5Cslave%5Ctest%5Cbuild%5Ctests%5Cmarionette%5Cclient 08:22:37 INFO - Unpacking c:\slave\test\build\tests\marionette\harness\marionette_harness\runner\mixins\browsermob-proxy-py 08:22:37 INFO - Running setup.py egg_info for package from file:///c%7C%5Cslave%5Ctest%5Cbuild%5Ctests%5Cmarionette%5Charness%5Cmarionette_harness%5Crunner%5Cmixins%5Cbrowsermob-proxy-py 08:22:37 INFO - Unpacking c:\slave\test\build\tests\marionette\harness 08:22:37 INFO - Running setup.py egg_info for package from file:///c%7C%5Cslave%5Ctest%5Cbuild%5Ctests%5Cmarionette%5Charness 08:22:37 INFO - Unpacking c:\slave\test\build\tests\marionette\puppeteer\firefox 08:22:37 INFO - Running setup.py egg_info for package from file:///c%7C%5Cslave%5Ctest%5Cbuild%5Ctests%5Cmarionette%5Cpuppeteer%5Cfirefox 08:22:46 INFO - Installing collected packages: browsermob-proxy, firefox-puppeteer, manifestparser, marionette-driver, marionette-harness, mozcrash, mozdebug, mozdevice, mozfile, mozhttpd, mozinfo, mozInstall, mozleak, mozlog, moznetwork, mozprocess, mozprofile, mozrunner, mozscreenshot, moztest, mozversion, wptserve 08:22:46 INFO - Running setup.py install for browsermob-proxy 08:22:46 INFO - Running setup.py install for firefox-puppeteer 08:22:46 INFO - Running setup.py install for manifestparser 08:22:46 INFO - Installing manifestparser-script.py script to C:\slave\test\build\venv\Scripts 08:22:46 INFO - Installing manifestparser.exe script to C:\slave\test\build\venv\Scripts 08:22:46 INFO - Running setup.py install for marionette-driver 08:22:46 INFO - Running setup.py install for marionette-harness 08:22:46 INFO - Installing marionette-script.py script to C:\slave\test\build\venv\Scripts 08:22:46 INFO - Installing marionette.exe script to C:\slave\test\build\venv\Scripts 08:22:46 INFO - Running setup.py install for mozcrash 08:22:46 INFO - Running setup.py install for mozdebug 08:22:46 INFO - Running setup.py install for mozdevice 08:22:46 INFO - Installing sutini-script.py script to C:\slave\test\build\venv\Scripts 08:22:46 INFO - Installing sutini.exe script to C:\slave\test\build\venv\Scripts 08:22:46 INFO - Installing dm-script.py script to C:\slave\test\build\venv\Scripts 08:22:46 INFO - Installing dm.exe script to C:\slave\test\build\venv\Scripts 08:22:46 INFO - Running setup.py install for mozfile 08:22:46 INFO - Running setup.py install for mozhttpd 08:22:46 INFO - Installing mozhttpd-script.py script to C:\slave\test\build\venv\Scripts 08:22:46 INFO - Installing mozhttpd.exe script to C:\slave\test\build\venv\Scripts 08:22:46 INFO - Running setup.py install for mozinfo 08:22:46 INFO - Installing mozinfo-script.py script to C:\slave\test\build\venv\Scripts 08:22:46 INFO - Installing mozinfo.exe script to C:\slave\test\build\venv\Scripts 08:22:46 INFO - Running setup.py install for mozInstall 08:22:46 INFO - Installing moz_remove_from_system-script.py script to C:\slave\test\build\venv\Scripts 08:22:46 INFO - Installing moz_remove_from_system.exe script to C:\slave\test\build\venv\Scripts 08:22:46 INFO - Installing mozuninstall-script.py script to C:\slave\test\build\venv\Scripts 08:22:46 INFO - Installing mozuninstall.exe script to C:\slave\test\build\venv\Scripts 08:22:46 INFO - Installing mozinstall-script.py script to C:\slave\test\build\venv\Scripts 08:22:46 INFO - Installing mozinstall.exe script to C:\slave\test\build\venv\Scripts 08:22:46 INFO - Installing moz_add_to_system-script.py script to C:\slave\test\build\venv\Scripts 08:22:46 INFO - Installing moz_add_to_system.exe script to C:\slave\test\build\venv\Scripts 08:22:46 INFO - Running setup.py install for mozleak 08:22:46 INFO - Running setup.py install for mozlog 08:22:46 INFO - Installing structlog-script.py script to C:\slave\test\build\venv\Scripts 08:22:46 INFO - Installing structlog.exe script to C:\slave\test\build\venv\Scripts 08:22:46 INFO - Running setup.py install for moznetwork 08:22:46 INFO - Installing moznetwork-script.py script to C:\slave\test\build\venv\Scripts 08:22:46 INFO - Installing moznetwork.exe script to C:\slave\test\build\venv\Scripts 08:22:46 INFO - Running setup.py install for mozprocess 08:22:46 INFO - Running setup.py install for mozprofile 08:22:46 INFO - Installing mozprofile-script.py script to C:\slave\test\build\venv\Scripts 08:22:46 INFO - Installing mozprofile.exe script to C:\slave\test\build\venv\Scripts 08:22:46 INFO - Installing diff-profiles-script.py script to C:\slave\test\build\venv\Scripts 08:22:46 INFO - Installing diff-profiles.exe script to C:\slave\test\build\venv\Scripts 08:22:46 INFO - Installing view-profile-script.py script to C:\slave\test\build\venv\Scripts 08:22:46 INFO - Installing view-profile.exe script to C:\slave\test\build\venv\Scripts 08:22:46 INFO - Running setup.py install for mozrunner 08:22:46 INFO - Installing mozrunner-script.py script to C:\slave\test\build\venv\Scripts 08:22:46 INFO - Installing mozrunner.exe script to C:\slave\test\build\venv\Scripts 08:22:46 INFO - Running setup.py install for mozscreenshot 08:22:46 INFO - Running setup.py install for moztest 08:22:46 INFO - Running setup.py install for mozversion 08:22:46 INFO - Installing mozversion-script.py script to C:\slave\test\build\venv\Scripts 08:22:46 INFO - Installing mozversion.exe script to C:\slave\test\build\venv\Scripts 08:22:46 INFO - Running setup.py install for wptserve 08:22:46 INFO - Successfully installed browsermob-proxy firefox-puppeteer manifestparser marionette-driver marionette-harness mozcrash mozdebug mozdevice mozfile mozhttpd mozinfo mozInstall mozleak mozlog moznetwork mozprocess mozprofile mozrunner mozscreenshot moztest mozversion wptserve 08:22:46 INFO - Cleaning up... 08:22:46 INFO - Return code: 0 08:22:46 INFO - Installing None into virtualenv C:\slave\test\build\venv 08:22:46 INFO - proxxy config: {'regions': ['.use1.', '.usw2.', '.scl3'], 'instances': ['proxxy1.srv.releng.use1.mozilla.com', 'proxxy1.srv.releng.usw2.mozilla.com', 'proxxy1.srv.releng.scl3.mozilla.com'], 'urls': [('http://ftp.mozilla.org', 'ftp.mozilla.org'), ('https://ftp.mozilla.org', 'ftp.mozilla.org'), ('https://ftp-ssl.mozilla.org', 'ftp.mozilla.org'), ('http://pypi.pvt.build.mozilla.org', 'pypi.pvt.build.mozilla.org'), ('http://pypi.pub.build.mozilla.org', 'pypi.pub.build.mozilla.org')]} 08:22:46 INFO - http://pypi.pvt.build.mozilla.org/pub matches http://pypi.pvt.build.mozilla.org 08:22:46 INFO - proxxy config: {'regions': ['.use1.', '.usw2.', '.scl3'], 'instances': ['proxxy1.srv.releng.use1.mozilla.com', 'proxxy1.srv.releng.usw2.mozilla.com', 'proxxy1.srv.releng.scl3.mozilla.com'], 'urls': [('http://ftp.mozilla.org', 'ftp.mozilla.org'), ('https://ftp.mozilla.org', 'ftp.mozilla.org'), ('https://ftp-ssl.mozilla.org', 'ftp.mozilla.org'), ('http://pypi.pvt.build.mozilla.org', 'pypi.pvt.build.mozilla.org'), ('http://pypi.pub.build.mozilla.org', 'pypi.pub.build.mozilla.org')]} 08:22:46 INFO - http://pypi.pub.build.mozilla.org/pub matches http://pypi.pub.build.mozilla.org 08:22:46 INFO - retry: Calling run_command with args: [['C:\\slave\\test\\build\\venv\\Scripts\\pip', 'install', '--timeout', '120', '-r', 'C:\\slave\\test\\build\\tests\\config\\marionette_requirements.txt', '--no-index', '--find-links', 'http://pypi.pvt.build.mozilla.org/pub', '--find-links', 'http://pypi.pub.build.mozilla.org/pub']], kwargs: {'error_level': 'warning', 'error_list': [{'substr': 'not found or a compiler error:', 'level': 'warning'}, {'regex': <_sre.SRE_Pattern object at 0x00A4EE90>, 'level': 'error'}, {'regex': <_sre.SRE_Pattern object at 0x00ADEA70>, 'level': 'warning'}, {'regex': <_sre.SRE_Pattern object at 0x00C46F80>, 'level': 'debug'}, {'substr': 'command not found', 'level': 'error'}, {'regex': <_sre.SRE_Pattern object at 0x00B99368>, 'level': 'warning'}, {'substr': 'Traceback (most recent call last)', 'level': 'error'}, {'substr': 'SyntaxError: ', 'level': 'error'}, {'substr': 'TypeError: ', 'level': 'error'}, {'substr': 'NameError: ', 'level': 'error'}, {'substr': 'ZeroDivisionError: ', 'level': 'error'}, {'regex': <_sre.SRE_Pattern object at 0x00A7A700>, 'level': 'critical'}, {'regex': <_sre.SRE_Pattern object at 0x00B982A0>, 'level': 'critical'}], 'cwd': 'C:\\slave\\test\\build\\tests\\config', 'env': {'TMP': 'C:\\DOCUME~1\\CLTBLD~1.T-X\\LOCALS~1\\Temp', 'MOZILLABUILD': 'D:\\mozilla-build', 'COMPUTERNAME': 'T-XP32-IX-022', 'USERDOMAIN': 'T-XP32-IX-022', 'KTS_VERSION': '1.19c', 'LIBPATH': 'C:\\WINDOWS\\Microsoft.NET\\Framework\\v2.0.50727;D:\\msvs8\\VC\\ATLMFC\\LIB', 'COMMONPROGRAMFILES': 'C:\\Program Files\\Common Files', 'MOZILLABUILDPATH': '\\mozilla-build\\', 'PROCESSOR_IDENTIFIER': 'x86 Family 6 Model 30 Stepping 5, GenuineIntel', 'PROGRAMFILES': 'C:\\Program Files', 'PROCESSOR_REVISION': '1e05', 'DNSSUFFIX': 'wintest.releng.scl3.mozilla.com', 'SYSTEMROOT': 'C:\\WINDOWS', 'NO_EM_RESTART': '1', 'OURDRIVE': 'C:', 'MSVCDIR': 'D:\\msvs8\\VC', 'XPCOM_DEBUG_BREAK': 'warn', 'MONDIR': 'C:\\Monitor_config\\', 'TEMP': 'C:\\DOCUME~1\\CLTBLD~1.T-X\\LOCALS~1\\Temp', 'COMSPEC': 'C:\\WINDOWS\\system32\\cmd.exe', 'RUNLOGFILE': 'C:\\slave\\\\runslave.log', 'PROCESSOR_ARCHITECTURE': 'x86', 'VCVARS': 'D:\\msvs8\\VC\\bin\\vcvars32.bat', 'VSINSTALLDIR': 'D:\\msvs8', 'ALLUSERSPROFILE': 'C:\\Documents and Settings\\All Users', 'MOZILLABUILDDRIVE': 'C:', 'SESSIONNAME': 'Console', 'HOMEPATH': '\\Documents and Settings\\cltbld.T-XP32-IX-022', 'FRAMEWORKDIR': 'C:\\WINDOWS\\Microsoft.NET\\Framework', 'MOZBUILDDIR': 'C:\\mozilla-build\\', 'FRAMEWORKSDKDIR': 'D:\\msvs8\\SDK\\v2.0', 'TEST1': 'testie', 'LOGONSERVER': '\\\\T-XP32-IX-022', 'MOZ_NO_REMOTE': '1', 'MOZ_HIDE_RESULTS_TABLE': '1', 'WINDIR': 'C:\\WINDOWS', 'MOZ_TOOLS': 'D:\\mozilla-build\\moztools', 'PATH': 'C:\\Program Files\\NVIDIA Corporation\\PhysX\\Common;C:\\WINDOWS\\system32;C:\\WINDOWS;C:\\WINDOWS\\System32\\Wbem;C:\\WINDOWS\\system32\\WindowsPowerShell\\v1.0;C:\\mozilla-build\\python27;C:\\mozilla-build\\python27\\Scripts;C:\\mozilla-build\\msys\\bin;C:\\mozilla-build\\vim\\vim72;C:\\mozilla-build\\wget;C:\\mozilla-build\\info-zip;C:\\CoreUtils\\bin;C:\\mozilla-build\\buildbotve\\scripts;C:\\mozilla-build\\hg', 'MOZ_AIRBAG': '1', 'PROMPT': '$P$G', 'USERNAME': 'cltbld', 'NO_FAIL_ON_TEST_ERRORS': '1', 'PATHEXT': '.COM;.EXE;.BAT;.CMD;.VBS;.VBE;.JS;.JSE;.WSF;.WSH;.PSC1', 'FP_NO_HOST_CHECK': 'NO', 'DCLOCATION': 'SCL3', 'APPDATA': 'C:\\Documents and Settings\\cltbld.T-XP32-IX-022\\Application Data', 'HOMEDRIVE': 'C:', 'MOZ_MSVCVERSION': '8', 'FRAMEWORKVERSION': 'v2.0.50727', 'SYSTEMDRIVE': 'C:', 'SLAVEDIR': 'C:\\slave\\', 'NUMBER_OF_PROCESSORS': '8', 'DEVENVDIR': 'D:\\msvs8\\Common7\\IDE', 'PWD': 'C:\\slave\\test', 'PROCESSOR_LEVEL': '6', 'KTS_HOME': 'C:\\Program Files\\KTS', 'PROPERTIES_FILE': 'C:\\slave\\test/buildprops.json', 'MOZ_CRASHREPORTER_NO_REPORT': '1', 'VCINSTALLDIR': 'D:\\msvs8\\VC', 'OS': 'Windows_NT', 'USERPROFILE': 'C:\\Documents and Settings\\cltbld.T-XP32-IX-022'}}, attempt #1 08:22:46 INFO - Running command: ['C:\\slave\\test\\build\\venv\\Scripts\\pip', 'install', '--timeout', '120', '-r', 'C:\\slave\\test\\build\\tests\\config\\marionette_requirements.txt', '--no-index', '--find-links', 'http://pypi.pvt.build.mozilla.org/pub', '--find-links', 'http://pypi.pub.build.mozilla.org/pub'] in C:\slave\test\build\tests\config 08:22:46 INFO - Copy/paste: C:\slave\test\build\venv\Scripts\pip install --timeout 120 -r C:\slave\test\build\tests\config\marionette_requirements.txt --no-index --find-links http://pypi.pvt.build.mozilla.org/pub --find-links http://pypi.pub.build.mozilla.org/pub 08:22:46 INFO - Using env: {'ALLUSERSPROFILE': 'C:\\Documents and Settings\\All Users', 08:22:46 INFO - 'APPDATA': 'C:\\Documents and Settings\\cltbld.T-XP32-IX-022\\Application Data', 08:22:46 INFO - 'COMMONPROGRAMFILES': 'C:\\Program Files\\Common Files', 08:22:46 INFO - 'COMPUTERNAME': 'T-XP32-IX-022', 08:22:46 INFO - 'COMSPEC': 'C:\\WINDOWS\\system32\\cmd.exe', 08:22:46 INFO - 'DCLOCATION': 'SCL3', 08:22:46 INFO - 'DEVENVDIR': 'D:\\msvs8\\Common7\\IDE', 08:22:46 INFO - 'DNSSUFFIX': 'wintest.releng.scl3.mozilla.com', 08:22:46 INFO - 'FP_NO_HOST_CHECK': 'NO', 08:22:46 INFO - 'FRAMEWORKDIR': 'C:\\WINDOWS\\Microsoft.NET\\Framework', 08:22:46 INFO - 'FRAMEWORKSDKDIR': 'D:\\msvs8\\SDK\\v2.0', 08:22:46 INFO - 'FRAMEWORKVERSION': 'v2.0.50727', 08:22:46 INFO - 'HOMEDRIVE': 'C:', 08:22:46 INFO - 'HOMEPATH': '\\Documents and Settings\\cltbld.T-XP32-IX-022', 08:22:46 INFO - 'KTS_HOME': 'C:\\Program Files\\KTS', 08:22:46 INFO - 'KTS_VERSION': '1.19c', 08:22:46 INFO - 'LIBPATH': 'C:\\WINDOWS\\Microsoft.NET\\Framework\\v2.0.50727;D:\\msvs8\\VC\\ATLMFC\\LIB', 08:22:46 INFO - 'LOGONSERVER': '\\\\T-XP32-IX-022', 08:22:46 INFO - 'MONDIR': 'C:\\Monitor_config\\', 08:22:46 INFO - 'MOZBUILDDIR': 'C:\\mozilla-build\\', 08:22:46 INFO - 'MOZILLABUILD': 'D:\\mozilla-build', 08:22:46 INFO - 'MOZILLABUILDDRIVE': 'C:', 08:22:46 INFO - 'MOZILLABUILDPATH': '\\mozilla-build\\', 08:22:46 INFO - 'MOZ_AIRBAG': '1', 08:22:46 INFO - 'MOZ_CRASHREPORTER_NO_REPORT': '1', 08:22:46 INFO - 'MOZ_HIDE_RESULTS_TABLE': '1', 08:22:46 INFO - 'MOZ_MSVCVERSION': '8', 08:22:46 INFO - 'MOZ_NO_REMOTE': '1', 08:22:46 INFO - 'MOZ_TOOLS': 'D:\\mozilla-build\\moztools', 08:22:46 INFO - 'MSVCDIR': 'D:\\msvs8\\VC', 08:22:46 INFO - 'NO_EM_RESTART': '1', 08:22:46 INFO - 'NO_FAIL_ON_TEST_ERRORS': '1', 08:22:46 INFO - 'NUMBER_OF_PROCESSORS': '8', 08:22:46 INFO - 'OS': 'Windows_NT', 08:22:46 INFO - 'OURDRIVE': 'C:', 08:22:46 INFO - 'PATH': 'C:\\Program Files\\NVIDIA Corporation\\PhysX\\Common;C:\\WINDOWS\\system32;C:\\WINDOWS;C:\\WINDOWS\\System32\\Wbem;C:\\WINDOWS\\system32\\WindowsPowerShell\\v1.0;C:\\mozilla-build\\python27;C:\\mozilla-build\\python27\\Scripts;C:\\mozilla-build\\msys\\bin;C:\\mozilla-build\\vim\\vim72;C:\\mozilla-build\\wget;C:\\mozilla-build\\info-zip;C:\\CoreUtils\\bin;C:\\mozilla-build\\buildbotve\\scripts;C:\\mozilla-build\\hg', 08:22:46 INFO - 'PATHEXT': '.COM;.EXE;.BAT;.CMD;.VBS;.VBE;.JS;.JSE;.WSF;.WSH;.PSC1', 08:22:46 INFO - 'PROCESSOR_ARCHITECTURE': 'x86', 08:22:46 INFO - 'PROCESSOR_IDENTIFIER': 'x86 Family 6 Model 30 Stepping 5, GenuineIntel', 08:22:46 INFO - 'PROCESSOR_LEVEL': '6', 08:22:46 INFO - 'PROCESSOR_REVISION': '1e05', 08:22:46 INFO - 'PROGRAMFILES': 'C:\\Program Files', 08:22:46 INFO - 'PROMPT': '$P$G', 08:22:46 INFO - 'PROPERTIES_FILE': 'C:\\slave\\test/buildprops.json', 08:22:46 INFO - 'PWD': 'C:\\slave\\test', 08:22:46 INFO - 'RUNLOGFILE': 'C:\\slave\\\\runslave.log', 08:22:46 INFO - 'SESSIONNAME': 'Console', 08:22:46 INFO - 'SLAVEDIR': 'C:\\slave\\', 08:22:46 INFO - 'SYSTEMDRIVE': 'C:', 08:22:46 INFO - 'SYSTEMROOT': 'C:\\WINDOWS', 08:22:46 INFO - 'TEMP': 'C:\\DOCUME~1\\CLTBLD~1.T-X\\LOCALS~1\\Temp', 08:22:46 INFO - 'TEST1': 'testie', 08:22:46 INFO - 'TMP': 'C:\\DOCUME~1\\CLTBLD~1.T-X\\LOCALS~1\\Temp', 08:22:46 INFO - 'USERDOMAIN': 'T-XP32-IX-022', 08:22:46 INFO - 'USERNAME': 'cltbld', 08:22:46 INFO - 'USERPROFILE': 'C:\\Documents and Settings\\cltbld.T-XP32-IX-022', 08:22:46 INFO - 'VCINSTALLDIR': 'D:\\msvs8\\VC', 08:22:46 INFO - 'VCVARS': 'D:\\msvs8\\VC\\bin\\vcvars32.bat', 08:22:46 INFO - 'VSINSTALLDIR': 'D:\\msvs8', 08:22:46 INFO - 'WINDIR': 'C:\\WINDOWS', 08:22:46 INFO - 'XPCOM_DEBUG_BREAK': 'warn'} 08:22:51 INFO - Ignoring indexes: http://pypi.python.org/simple/ 08:22:51 INFO - Unpacking c:\slave\test\build\tests\mozbase\manifestparser 08:22:51 INFO - Running setup.py egg_info for package from file:///c%7C%5Cslave%5Ctest%5Cbuild%5Ctests%5Cmozbase%5Cmanifestparser 08:22:51 INFO - Unpacking c:\slave\test\build\tests\mozbase\mozcrash 08:22:51 INFO - Running setup.py egg_info for package from file:///c%7C%5Cslave%5Ctest%5Cbuild%5Ctests%5Cmozbase%5Cmozcrash 08:22:51 INFO - Unpacking c:\slave\test\build\tests\mozbase\mozdebug 08:22:51 INFO - Running setup.py egg_info for package from file:///c%7C%5Cslave%5Ctest%5Cbuild%5Ctests%5Cmozbase%5Cmozdebug 08:22:51 INFO - Unpacking c:\slave\test\build\tests\mozbase\mozdevice 08:22:51 INFO - Running setup.py egg_info for package from file:///c%7C%5Cslave%5Ctest%5Cbuild%5Ctests%5Cmozbase%5Cmozdevice 08:22:51 INFO - Unpacking c:\slave\test\build\tests\mozbase\mozfile 08:22:51 INFO - Running setup.py egg_info for package from file:///c%7C%5Cslave%5Ctest%5Cbuild%5Ctests%5Cmozbase%5Cmozfile 08:22:51 INFO - Unpacking c:\slave\test\build\tests\mozbase\mozhttpd 08:22:51 INFO - Running setup.py egg_info for package from file:///c%7C%5Cslave%5Ctest%5Cbuild%5Ctests%5Cmozbase%5Cmozhttpd 08:22:51 INFO - Unpacking c:\slave\test\build\tests\mozbase\mozinfo 08:22:51 INFO - Running setup.py egg_info for package from file:///c%7C%5Cslave%5Ctest%5Cbuild%5Ctests%5Cmozbase%5Cmozinfo 08:22:51 INFO - Unpacking c:\slave\test\build\tests\mozbase\mozinstall 08:22:51 INFO - Running setup.py egg_info for package from file:///c%7C%5Cslave%5Ctest%5Cbuild%5Ctests%5Cmozbase%5Cmozinstall 08:22:51 INFO - Unpacking c:\slave\test\build\tests\mozbase\mozleak 08:22:51 INFO - Running setup.py egg_info for package from file:///c%7C%5Cslave%5Ctest%5Cbuild%5Ctests%5Cmozbase%5Cmozleak 08:22:51 INFO - Unpacking c:\slave\test\build\tests\mozbase\mozlog 08:22:51 INFO - Running setup.py egg_info for package from file:///c%7C%5Cslave%5Ctest%5Cbuild%5Ctests%5Cmozbase%5Cmozlog 08:22:51 INFO - Unpacking c:\slave\test\build\tests\mozbase\moznetwork 08:22:51 INFO - Running setup.py egg_info for package from file:///c%7C%5Cslave%5Ctest%5Cbuild%5Ctests%5Cmozbase%5Cmoznetwork 08:22:51 INFO - Unpacking c:\slave\test\build\tests\mozbase\mozprocess 08:22:51 INFO - Running setup.py egg_info for package from file:///c%7C%5Cslave%5Ctest%5Cbuild%5Ctests%5Cmozbase%5Cmozprocess 08:22:51 INFO - Unpacking c:\slave\test\build\tests\mozbase\mozprofile 08:22:51 INFO - Running setup.py egg_info for package from file:///c%7C%5Cslave%5Ctest%5Cbuild%5Ctests%5Cmozbase%5Cmozprofile 08:22:51 INFO - Unpacking c:\slave\test\build\tests\mozbase\mozrunner 08:22:51 INFO - Running setup.py egg_info for package from file:///c%7C%5Cslave%5Ctest%5Cbuild%5Ctests%5Cmozbase%5Cmozrunner 08:22:51 INFO - Unpacking c:\slave\test\build\tests\mozbase\mozscreenshot 08:22:51 INFO - Running setup.py egg_info for package from file:///c%7C%5Cslave%5Ctest%5Cbuild%5Ctests%5Cmozbase%5Cmozscreenshot 08:22:51 INFO - Unpacking c:\slave\test\build\tests\mozbase\moztest 08:22:51 INFO - Running setup.py egg_info for package from file:///c%7C%5Cslave%5Ctest%5Cbuild%5Ctests%5Cmozbase%5Cmoztest 08:22:51 INFO - Unpacking c:\slave\test\build\tests\mozbase\mozversion 08:22:51 INFO - Running setup.py egg_info for package from file:///c%7C%5Cslave%5Ctest%5Cbuild%5Ctests%5Cmozbase%5Cmozversion 08:22:51 INFO - Unpacking c:\slave\test\build\tests\tools\wptserve 08:22:51 INFO - Running setup.py egg_info for package from file:///c%7C%5Cslave%5Ctest%5Cbuild%5Ctests%5Ctools%5Cwptserve 08:22:51 INFO - Unpacking c:\slave\test\build\tests\marionette\client 08:22:51 INFO - Running setup.py egg_info for package from file:///c%7C%5Cslave%5Ctest%5Cbuild%5Ctests%5Cmarionette%5Cclient 08:22:51 INFO - Unpacking c:\slave\test\build\tests\marionette\harness\marionette_harness\runner\mixins\browsermob-proxy-py 08:22:51 INFO - Running setup.py egg_info for package from file:///c%7C%5Cslave%5Ctest%5Cbuild%5Ctests%5Cmarionette%5Charness%5Cmarionette_harness%5Crunner%5Cmixins%5Cbrowsermob-proxy-py 08:22:51 INFO - Unpacking c:\slave\test\build\tests\marionette\harness 08:22:51 INFO - Running setup.py egg_info for package from file:///c%7C%5Cslave%5Ctest%5Cbuild%5Ctests%5Cmarionette%5Charness 08:22:51 INFO - Unpacking c:\slave\test\build\tests\marionette\puppeteer\firefox 08:22:51 INFO - Running setup.py egg_info for package from file:///c%7C%5Cslave%5Ctest%5Cbuild%5Ctests%5Cmarionette%5Cpuppeteer%5Cfirefox 08:22:56 INFO - Requirement already satisfied (use --upgrade to upgrade): mozfile>=1.0 in c:\slave\test\build\venv\lib\site-packages (from mozcrash->-r C:\slave\test\build\tests\config\mozbase_requirements.txt (line 2)) 08:22:56 INFO - Requirement already satisfied (use --upgrade to upgrade): mozlog>=3.0 in c:\slave\test\build\venv\lib\site-packages (from mozcrash->-r C:\slave\test\build\tests\config\mozbase_requirements.txt (line 2)) 08:22:56 INFO - Requirement already satisfied (use --upgrade to upgrade): mozinfo in c:\slave\test\build\venv\lib\site-packages (from mozdebug->-r C:\slave\test\build\tests\config\mozbase_requirements.txt (line 3)) 08:22:56 INFO - Requirement already satisfied (use --upgrade to upgrade): moznetwork>=0.24 in c:\slave\test\build\venv\lib\site-packages (from mozdevice->-r C:\slave\test\build\tests\config\mozbase_requirements.txt (line 4)) 08:22:56 INFO - Requirement already satisfied (use --upgrade to upgrade): mozprocess>=0.19 in c:\slave\test\build\venv\lib\site-packages (from mozdevice->-r C:\slave\test\build\tests\config\mozbase_requirements.txt (line 4)) 08:22:56 INFO - Downloading/unpacking blessings>=1.3 (from mozlog->-r C:\slave\test\build\tests\config\mozbase_requirements.txt (line 10)) 08:22:56 INFO - Downloading blessings-1.6.tar.gz 08:22:56 INFO - Running setup.py egg_info for package blessings 08:22:56 INFO - Requirement already satisfied (use --upgrade to upgrade): requests>=1.1.0 in c:\slave\test\build\venv\lib\site-packages (from browsermob-proxy->-r C:\slave\test\build\tests\config\marionette_requirements.txt (line 5)) 08:22:56 INFO - Installing collected packages: blessings, browsermob-proxy, firefox-puppeteer, manifestparser, marionette-driver, marionette-harness, mozcrash, mozdebug, mozdevice, mozhttpd, mozInstall, mozleak, mozprofile, mozrunner, mozscreenshot, moztest, mozversion, wptserve 08:22:56 INFO - Running setup.py install for blessings 08:22:56 INFO - Running setup.py install for browsermob-proxy 08:22:56 INFO - Running setup.py install for firefox-puppeteer 08:22:56 INFO - Running setup.py install for manifestparser 08:22:56 INFO - Installing manifestparser-script.py script to C:\slave\test\build\venv\Scripts 08:22:56 INFO - Installing manifestparser.exe script to C:\slave\test\build\venv\Scripts 08:22:56 INFO - Running setup.py install for marionette-driver 08:22:56 INFO - Running setup.py install for marionette-harness 08:22:56 INFO - Installing marionette-script.py script to C:\slave\test\build\venv\Scripts 08:22:56 INFO - Installing marionette.exe script to C:\slave\test\build\venv\Scripts 08:22:56 INFO - Running setup.py install for mozcrash 08:22:56 INFO - Running setup.py install for mozdebug 08:22:56 INFO - Running setup.py install for mozdevice 08:22:56 INFO - Installing sutini-script.py script to C:\slave\test\build\venv\Scripts 08:22:56 INFO - Installing sutini.exe script to C:\slave\test\build\venv\Scripts 08:22:56 INFO - Installing dm-script.py script to C:\slave\test\build\venv\Scripts 08:22:56 INFO - Installing dm.exe script to C:\slave\test\build\venv\Scripts 08:22:56 INFO - Running setup.py install for mozhttpd 08:22:56 INFO - Installing mozhttpd-script.py script to C:\slave\test\build\venv\Scripts 08:22:56 INFO - Installing mozhttpd.exe script to C:\slave\test\build\venv\Scripts 08:22:56 INFO - Running setup.py install for mozInstall 08:22:56 INFO - Installing moz_remove_from_system-script.py script to C:\slave\test\build\venv\Scripts 08:22:56 INFO - Installing moz_remove_from_system.exe script to C:\slave\test\build\venv\Scripts 08:22:56 INFO - Installing mozuninstall-script.py script to C:\slave\test\build\venv\Scripts 08:22:56 INFO - Installing mozuninstall.exe script to C:\slave\test\build\venv\Scripts 08:22:56 INFO - Installing mozinstall-script.py script to C:\slave\test\build\venv\Scripts 08:22:57 INFO - Installing mozinstall.exe script to C:\slave\test\build\venv\Scripts 08:22:57 INFO - Installing moz_add_to_system-script.py script to C:\slave\test\build\venv\Scripts 08:22:57 INFO - Installing moz_add_to_system.exe script to C:\slave\test\build\venv\Scripts 08:22:57 INFO - Running setup.py install for mozleak 08:22:57 INFO - Running setup.py install for mozprofile 08:22:57 INFO - Installing mozprofile-script.py script to C:\slave\test\build\venv\Scripts 08:22:57 INFO - Installing mozprofile.exe script to C:\slave\test\build\venv\Scripts 08:22:57 INFO - Installing diff-profiles-script.py script to C:\slave\test\build\venv\Scripts 08:22:57 INFO - Installing diff-profiles.exe script to C:\slave\test\build\venv\Scripts 08:22:57 INFO - Installing view-profile-script.py script to C:\slave\test\build\venv\Scripts 08:22:57 INFO - Installing view-profile.exe script to C:\slave\test\build\venv\Scripts 08:22:57 INFO - Running setup.py install for mozrunner 08:22:58 INFO - Installing mozrunner-script.py script to C:\slave\test\build\venv\Scripts 08:22:58 INFO - Installing mozrunner.exe script to C:\slave\test\build\venv\Scripts 08:22:58 INFO - Running setup.py install for mozscreenshot 08:22:58 INFO - Running setup.py install for moztest 08:22:58 INFO - Running setup.py install for mozversion 08:22:58 INFO - Installing mozversion-script.py script to C:\slave\test\build\venv\Scripts 08:22:58 INFO - Installing mozversion.exe script to C:\slave\test\build\venv\Scripts 08:22:58 INFO - Running setup.py install for wptserve 08:22:58 INFO - Successfully installed blessings browsermob-proxy firefox-puppeteer manifestparser marionette-driver marionette-harness mozcrash mozdebug mozdevice mozhttpd mozInstall mozleak mozprofile mozrunner mozscreenshot moztest mozversion wptserve 08:22:58 INFO - Cleaning up... 08:22:58 INFO - Return code: 0 08:22:58 INFO - Done creating virtualenv C:\slave\test\build\venv. 08:22:58 INFO - Getting output from command: ['C:\\slave\\test\\build\\venv\\Scripts\\pip', 'freeze'] 08:22:58 INFO - Copy/paste: C:\slave\test\build\venv\Scripts\pip freeze 08:22:58 INFO - Reading from file tmpfile_stdout 08:22:58 INFO - Using _rmtree_windows ... 08:22:58 INFO - Using _rmtree_windows ... 08:22:58 INFO - Current package versions: 08:22:58 INFO - blessings == 1.6 08:22:58 INFO - blobuploader == 1.2.4 08:22:58 INFO - browsermob-proxy == 0.6.0 08:22:58 INFO - distribute == 0.6.14 08:22:58 INFO - docopt == 0.6.1 08:22:58 INFO - firefox-puppeteer == 52.1.0 08:22:58 INFO - functools32 == 3.2.3-2 08:22:58 INFO - jsonschema == 2.5.1 08:22:58 INFO - manifestparser == 1.1 08:22:58 INFO - marionette-driver == 2.2.0 08:22:58 INFO - marionette-harness == 4.0.0 08:22:58 INFO - mozInstall == 1.12 08:22:58 INFO - mozcrash == 1.0 08:22:58 INFO - mozdebug == 0.1 08:22:58 INFO - mozdevice == 0.48 08:22:58 INFO - mozfile == 1.2 08:22:58 INFO - mozhttpd == 0.7 08:22:58 INFO - mozinfo == 0.9 08:22:58 INFO - mozleak == 0.1 08:22:58 INFO - mozlog == 3.4 08:22:58 INFO - moznetwork == 0.27 08:22:58 INFO - mozprocess == 0.23 08:22:58 INFO - mozprofile == 0.28 08:22:58 INFO - mozrunner == 6.13 08:22:58 INFO - mozscreenshot == 0.1 08:22:58 INFO - mozsystemmonitor == 0.3 08:22:58 INFO - moztest == 0.7 08:22:58 INFO - mozversion == 1.4 08:22:58 INFO - requests == 1.2.3 08:22:58 INFO - wptserve == 1.4.0 08:22:58 INFO - Running post-action listener: _resource_record_post_action 08:22:58 INFO - Running post-action listener: _start_resource_monitoring 08:22:58 INFO - Starting resource monitoring. 08:22:58 INFO - [mozharness: 2016-12-22 16:22:58.899000Z] Finished create-virtualenv step (success) 08:22:58 INFO - [mozharness: 2016-12-22 16:22:58.899000Z] Running install step. 08:22:58 INFO - Running pre-action listener: _resource_record_pre_action 08:22:58 INFO - Running main action method: install 08:22:58 INFO - Getting output from command: ['C:\\slave\\test\\build\\venv\\Scripts\\pip', 'freeze'] 08:22:58 INFO - Copy/paste: C:\slave\test\build\venv\Scripts\pip freeze 08:22:59 INFO - Reading from file tmpfile_stdout 08:22:59 INFO - Using _rmtree_windows ... 08:22:59 INFO - Using _rmtree_windows ... 08:22:59 INFO - Detecting whether we're running mozinstall >=1.0... 08:22:59 INFO - Getting output from command: ['C:\\slave\\test/build/venv/scripts/python', 'C:\\slave\\test/build/venv/scripts/mozinstall-script.py', '-h'] 08:22:59 INFO - Copy/paste: C:\slave\test/build/venv/scripts/python C:\slave\test/build/venv/scripts/mozinstall-script.py -h 08:22:59 INFO - Reading from file tmpfile_stdout 08:22:59 INFO - Output received: 08:22:59 INFO - Usage: mozinstall-script.py [options] installer 08:22:59 INFO - Options: 08:22:59 INFO - -h, --help show this help message and exit 08:22:59 INFO - -d DEST, --destination=DEST 08:22:59 INFO - Directory to install application into. [default: 08:22:59 INFO - "C:\slave\test"] 08:22:59 INFO - --app=APP Application being installed. [default: firefox] 08:22:59 INFO - Using _rmtree_windows ... 08:22:59 INFO - Using _rmtree_windows ... 08:22:59 INFO - mkdir: C:\slave\test\build\application 08:22:59 INFO - Getting output from command: ['C:\\slave\\test/build/venv/scripts/python', 'C:\\slave\\test/build/venv/scripts/mozinstall-script.py', 'C:\\slave\\test\\build\\firefox-52.0a2.en-US.win32.zip', '--destination', 'C:\\slave\\test\\build\\application'] 08:22:59 INFO - Copy/paste: C:\slave\test/build/venv/scripts/python C:\slave\test/build/venv/scripts/mozinstall-script.py C:\slave\test\build\firefox-52.0a2.en-US.win32.zip --destination C:\slave\test\build\application 08:23:02 INFO - Reading from file tmpfile_stdout 08:23:02 INFO - Output received: 08:23:02 INFO - C:\slave\test\build\application\firefox\firefox.exe 08:23:02 INFO - Using _rmtree_windows ... 08:23:02 INFO - Using _rmtree_windows ... 08:23:02 INFO - Running post-action listener: _resource_record_post_action 08:23:02 INFO - [mozharness: 2016-12-22 16:23:02.321000Z] Finished install step (success) 08:23:02 INFO - [mozharness: 2016-12-22 16:23:02.321000Z] Running run-tests step. 08:23:02 INFO - Running pre-action listener: _resource_record_pre_action 08:23:02 INFO - Running main action method: run_tests 08:23:02 INFO - The emulator type: arm 08:23:02 INFO - mkdir: C:\slave\test\build\blobber_upload_dir 08:23:02 INFO - Minidump filename unknown. Determining based upon platform and architecture. 08:23:02 INFO - Minidump tooltool manifest unknown. Determining based upon platform and architecture. 08:23:02 INFO - grabbing minidump binary from tooltool 08:23:02 INFO - proxxy config: {'regions': ['.use1.', '.usw2.', '.scl3'], 'instances': ['proxxy1.srv.releng.use1.mozilla.com', 'proxxy1.srv.releng.usw2.mozilla.com', 'proxxy1.srv.releng.scl3.mozilla.com'], 'urls': [('http://ftp.mozilla.org', 'ftp.mozilla.org'), ('https://ftp.mozilla.org', 'ftp.mozilla.org'), ('https://ftp-ssl.mozilla.org', 'ftp.mozilla.org'), ('http://pypi.pvt.build.mozilla.org', 'pypi.pvt.build.mozilla.org'), ('http://pypi.pub.build.mozilla.org', 'pypi.pub.build.mozilla.org')]} 08:23:02 INFO - retry: Calling run_command with args: (['c:\\mozilla-build\\python27\\python.exe', 'C:/mozilla-build/tooltool.py', '--url', 'https://api.pub.build.mozilla.org/tooltool/', '--authentication-file', 'c:\\builds\\relengapi.tok', 'fetch', '-m', 'C:\\slave\\test\\build\\tests\\config/tooltool-manifests/win32/releng.manifest', '-o'],), kwargs: {'output_timeout': 600, 'error_list': [{'substr': 'command not found', 'level': 'error'}, {'regex': <_sre.SRE_Pattern object at 0x00B99368>, 'level': 'warning'}, {'substr': 'Traceback (most recent call last)', 'level': 'error'}, {'substr': 'SyntaxError: ', 'level': 'error'}, {'substr': 'TypeError: ', 'level': 'error'}, {'substr': 'NameError: ', 'level': 'error'}, {'substr': 'ZeroDivisionError: ', 'level': 'error'}, {'regex': <_sre.SRE_Pattern object at 0x00A7A700>, 'level': 'critical'}, {'regex': <_sre.SRE_Pattern object at 0x00B982A0>, 'level': 'critical'}, {'substr': 'ERROR - ', 'level': 'error'}], 'cwd': 'C:\\slave\\test\\build', 'privileged': False}, attempt #1 08:23:02 INFO - Running command: ['c:\\mozilla-build\\python27\\python.exe', 'C:/mozilla-build/tooltool.py', '--url', 'https://api.pub.build.mozilla.org/tooltool/', '--authentication-file', 'c:\\builds\\relengapi.tok', 'fetch', '-m', 'C:\\slave\\test\\build\\tests\\config/tooltool-manifests/win32/releng.manifest', '-o'] in C:\slave\test\build 08:23:02 INFO - Copy/paste: c:\mozilla-build\python27\python.exe C:/mozilla-build/tooltool.py --url https://api.pub.build.mozilla.org/tooltool/ --authentication-file c:\builds\relengapi.tok fetch -m C:\slave\test\build\tests\config/tooltool-manifests/win32/releng.manifest -o 08:23:02 INFO - Calling ['c:\\mozilla-build\\python27\\python.exe', 'C:/mozilla-build/tooltool.py', '--url', 'https://api.pub.build.mozilla.org/tooltool/', '--authentication-file', 'c:\\builds\\relengapi.tok', 'fetch', '-m', 'C:\\slave\\test\\build\\tests\\config/tooltool-manifests/win32/releng.manifest', '-o'] with output_timeout 600 08:23:02 INFO - INFO - Attempting to fetch from 'https://api.pub.build.mozilla.org/tooltool/'... 08:23:02 INFO - INFO - File win32-minidump_stackwalk.exe fetched from https://api.pub.build.mozilla.org/tooltool/ as C:\slave\test\build\tmp6jw1rw 08:23:02 INFO - INFO - File integrity verified, renaming tmp6jw1rw to win32-minidump_stackwalk.exe 08:23:02 INFO - Return code: 0 08:23:02 INFO - Chmoding C:\slave\test\build\win32-minidump_stackwalk.exe to 0755 08:23:02 INFO - Running command: ['C:\\slave\\test\\build\\venv\\Scripts\\python', '-u', 'C:\\slave\\test\\build\\tests\\marionette\\harness\\marionette_harness\\runtests.py', '--disable-e10s', '--gecko-log=C:\\slave\\test\\build\\blobber_upload_dir\\gecko.log', '--log-raw=C:\\slave\\test\\build\\blobber_upload_dir\\marionette_raw.log', '--log-errorsummary=C:\\slave\\test\\build\\blobber_upload_dir\\marionette_errorsummary.log', '--log-html=C:\\slave\\test\\build\\blobber_upload_dir\\report.html', '--binary=C:\\slave\\test\\build\\application\\firefox\\firefox.exe', '--address=localhost:2828', '--symbols-path=https://queue.taskcluster.net/v1/task/VyPEbHbKTuCa6riT6uy3nQ/artifacts/public/build/firefox-52.0a2.en-US.win32.crashreporter-symbols.zip', 'C:\\slave\\test\\build\\tests\\marionette\\tests\\testing\\marionette\\harness\\marionette_harness\\tests\\unit-tests.ini'] 08:23:02 INFO - Copy/paste: C:\slave\test\build\venv\Scripts\python -u C:\slave\test\build\tests\marionette\harness\marionette_harness\runtests.py --disable-e10s --gecko-log=C:\slave\test\build\blobber_upload_dir\gecko.log --log-raw=C:\slave\test\build\blobber_upload_dir\marionette_raw.log --log-errorsummary=C:\slave\test\build\blobber_upload_dir\marionette_errorsummary.log --log-html=C:\slave\test\build\blobber_upload_dir\report.html --binary=C:\slave\test\build\application\firefox\firefox.exe --address=localhost:2828 --symbols-path=https://queue.taskcluster.net/v1/task/VyPEbHbKTuCa6riT6uy3nQ/artifacts/public/build/firefox-52.0a2.en-US.win32.crashreporter-symbols.zip C:\slave\test\build\tests\marionette\tests\testing\marionette\harness\marionette_harness\tests\unit-tests.ini 08:23:02 INFO - Using env: {'ALLUSERSPROFILE': 'C:\\Documents and Settings\\All Users', 08:23:02 INFO - 'APPDATA': 'C:\\Documents and Settings\\cltbld.T-XP32-IX-022\\Application Data', 08:23:02 INFO - 'COMMONPROGRAMFILES': 'C:\\Program Files\\Common Files', 08:23:02 INFO - 'COMPUTERNAME': 'T-XP32-IX-022', 08:23:02 INFO - 'COMSPEC': 'C:\\WINDOWS\\system32\\cmd.exe', 08:23:02 INFO - 'DCLOCATION': 'SCL3', 08:23:02 INFO - 'DEVENVDIR': 'D:\\msvs8\\Common7\\IDE', 08:23:02 INFO - 'DNSSUFFIX': 'wintest.releng.scl3.mozilla.com', 08:23:02 INFO - 'FP_NO_HOST_CHECK': 'NO', 08:23:02 INFO - 'FRAMEWORKDIR': 'C:\\WINDOWS\\Microsoft.NET\\Framework', 08:23:02 INFO - 'FRAMEWORKSDKDIR': 'D:\\msvs8\\SDK\\v2.0', 08:23:02 INFO - 'FRAMEWORKVERSION': 'v2.0.50727', 08:23:02 INFO - 'HOMEDRIVE': 'C:', 08:23:02 INFO - 'HOMEPATH': '\\Documents and Settings\\cltbld.T-XP32-IX-022', 08:23:02 INFO - 'KTS_HOME': 'C:\\Program Files\\KTS', 08:23:02 INFO - 'KTS_VERSION': '1.19c', 08:23:02 INFO - 'LIBPATH': 'C:\\WINDOWS\\Microsoft.NET\\Framework\\v2.0.50727;D:\\msvs8\\VC\\ATLMFC\\LIB', 08:23:02 INFO - 'LOGONSERVER': '\\\\T-XP32-IX-022', 08:23:02 INFO - 'MINIDUMP_SAVE_PATH': 'C:\\slave\\test\\build\\blobber_upload_dir', 08:23:02 INFO - 'MINIDUMP_STACKWALK': 'C:\\slave\\test\\build\\win32-minidump_stackwalk.exe', 08:23:02 INFO - 'MONDIR': 'C:\\Monitor_config\\', 08:23:02 INFO - 'MOZBUILDDIR': 'C:\\mozilla-build\\', 08:23:02 INFO - 'MOZILLABUILD': 'D:\\mozilla-build', 08:23:02 INFO - 'MOZILLABUILDDRIVE': 'C:', 08:23:02 INFO - 'MOZILLABUILDPATH': '\\mozilla-build\\', 08:23:02 INFO - 'MOZ_AIRBAG': '1', 08:23:02 INFO - 'MOZ_CRASHREPORTER_NO_REPORT': '1', 08:23:02 INFO - 'MOZ_HIDE_RESULTS_TABLE': '1', 08:23:02 INFO - 'MOZ_MSVCVERSION': '8', 08:23:02 INFO - 'MOZ_NO_REMOTE': '1', 08:23:02 INFO - 'MOZ_TOOLS': 'D:\\mozilla-build\\moztools', 08:23:02 INFO - 'MOZ_UPLOAD_DIR': 'C:\\slave\\test\\build\\blobber_upload_dir', 08:23:02 INFO - 'MSVCDIR': 'D:\\msvs8\\VC', 08:23:02 INFO - 'NO_EM_RESTART': '1', 08:23:02 INFO - 'NO_FAIL_ON_TEST_ERRORS': '1', 08:23:02 INFO - 'NUMBER_OF_PROCESSORS': '8', 08:23:02 INFO - 'OS': 'Windows_NT', 08:23:02 INFO - 'OURDRIVE': 'C:', 08:23:02 INFO - 'PATH': 'C:\\Program Files\\NVIDIA Corporation\\PhysX\\Common;C:\\WINDOWS\\system32;C:\\WINDOWS;C:\\WINDOWS\\System32\\Wbem;C:\\WINDOWS\\system32\\WindowsPowerShell\\v1.0;C:\\mozilla-build\\python27;C:\\mozilla-build\\python27\\Scripts;C:\\mozilla-build\\msys\\bin;C:\\mozilla-build\\vim\\vim72;C:\\mozilla-build\\wget;C:\\mozilla-build\\info-zip;C:\\CoreUtils\\bin;C:\\mozilla-build\\buildbotve\\scripts;C:\\mozilla-build\\hg', 08:23:02 INFO - 'PATHEXT': '.COM;.EXE;.BAT;.CMD;.VBS;.VBE;.JS;.JSE;.WSF;.WSH;.PSC1', 08:23:02 INFO - 'PROCESSOR_ARCHITECTURE': 'x86', 08:23:02 INFO - 'PROCESSOR_IDENTIFIER': 'x86 Family 6 Model 30 Stepping 5, GenuineIntel', 08:23:02 INFO - 'PROCESSOR_LEVEL': '6', 08:23:02 INFO - 'PROCESSOR_REVISION': '1e05', 08:23:02 INFO - 'PROGRAMFILES': 'C:\\Program Files', 08:23:02 INFO - 'PROMPT': '$P$G', 08:23:02 INFO - 'PROPERTIES_FILE': 'C:\\slave\\test/buildprops.json', 08:23:02 INFO - 'PWD': 'C:\\slave\\test', 08:23:02 INFO - 'RUNLOGFILE': 'C:\\slave\\\\runslave.log', 08:23:02 INFO - 'SESSIONNAME': 'Console', 08:23:02 INFO - 'SLAVEDIR': 'C:\\slave\\', 08:23:02 INFO - 'SYSTEMDRIVE': 'C:', 08:23:02 INFO - 'SYSTEMROOT': 'C:\\WINDOWS', 08:23:02 INFO - 'TEMP': 'C:\\DOCUME~1\\CLTBLD~1.T-X\\LOCALS~1\\Temp', 08:23:02 INFO - 'TEST1': 'testie', 08:23:02 INFO - 'TMP': 'C:\\DOCUME~1\\CLTBLD~1.T-X\\LOCALS~1\\Temp', 08:23:02 INFO - 'USERDOMAIN': 'T-XP32-IX-022', 08:23:02 INFO - 'USERNAME': 'cltbld', 08:23:02 INFO - 'USERPROFILE': 'C:\\Documents and Settings\\cltbld.T-XP32-IX-022', 08:23:02 INFO - 'VCINSTALLDIR': 'D:\\msvs8\\VC', 08:23:02 INFO - 'VCVARS': 'D:\\msvs8\\VC\\bin\\vcvars32.bat', 08:23:02 INFO - 'VSINSTALLDIR': 'D:\\msvs8', 08:23:02 INFO - 'WINDIR': 'C:\\WINDOWS', 08:23:02 INFO - 'XPCOM_DEBUG_BREAK': 'warn'} 08:23:02 INFO - Calling ['C:\\slave\\test\\build\\venv\\Scripts\\python', '-u', 'C:\\slave\\test\\build\\tests\\marionette\\harness\\marionette_harness\\runtests.py', '--disable-e10s', '--gecko-log=C:\\slave\\test\\build\\blobber_upload_dir\\gecko.log', '--log-raw=C:\\slave\\test\\build\\blobber_upload_dir\\marionette_raw.log', '--log-errorsummary=C:\\slave\\test\\build\\blobber_upload_dir\\marionette_errorsummary.log', '--log-html=C:\\slave\\test\\build\\blobber_upload_dir\\report.html', '--binary=C:\\slave\\test\\build\\application\\firefox\\firefox.exe', '--address=localhost:2828', '--symbols-path=https://queue.taskcluster.net/v1/task/VyPEbHbKTuCa6riT6uy3nQ/artifacts/public/build/firefox-52.0a2.en-US.win32.crashreporter-symbols.zip', 'C:\\slave\\test\\build\\tests\\marionette\\tests\\testing\\marionette\\harness\\marionette_harness\\tests\\unit-tests.ini'] with output_timeout 1000 08:23:03 INFO - Using workspace for temporary data: "C:\slave\test" 08:23:03 INFO - mozversion application_buildid: 20161222065253 08:23:03 INFO - mozversion application_changeset: 2805e2b6c22f55a9155a9f55ede9caa53508bdff 08:23:03 INFO - mozversion application_display_name: FirefoxDeveloperEdition 08:23:03 INFO - mozversion application_id: {ec8030f7-c20a-464f-9b0e-13a3a9e97384} 08:23:03 INFO - mozversion application_name: Firefox 08:23:03 INFO - mozversion application_remotingname: firefox-dev 08:23:03 INFO - mozversion application_repository: https://hg.mozilla.org/releases/mozilla-aurora 08:23:03 INFO - mozversion application_vendor: Mozilla 08:23:03 INFO - mozversion application_version: 52.0a2 08:23:03 INFO - mozversion platform_buildid: 20161222065253 08:23:03 INFO - mozversion platform_changeset: 2805e2b6c22f55a9155a9f55ede9caa53508bdff 08:23:03 INFO - mozversion platform_repository: https://hg.mozilla.org/releases/mozilla-aurora 08:23:03 INFO - mozversion platform_version: 52.0a2 08:23:03 INFO - Application command: C:\slave\test\build\application\firefox\firefox.exe -no-remote -marionette -profile c:\docume~1\cltbld~1.t-x\locals~1\temp\tmpw02xzl.mozrunner 08:23:09 INFO - Profile path is c:\docume~1\cltbld~1.t-x\locals~1\temp\tmpw02xzl.mozrunner 08:23:09 INFO - Starting fixture servers 08:25:16 INFO - {"thread": "MainThread", "level": "ERROR", "pid": 2488, "source": "Marionette test runner", "time": 1482423916072, "action": "log", "message": "Failure during harness execution", "stack": "Traceback (most recent call last):\n\n File \"C:\\slave\\test\\build\\tests\\marionette\\harness\\marionette_harness\\runtests.py\", line 89, in cli\n failed = harness_instance.run()\n\n File \"C:\\slave\\test\\build\\tests\\marionette\\harness\\marionette_harness\\runtests.py\", line 71, in run\n runner.run_tests(tests)\n\n File \"C:\\slave\\test\\build\\venv\\lib\\site-packages\\marionette_harness\\runner\\base.py\", line 815, in run_tests\n self.fixture_servers = self.start_fixture_servers()\n\n File \"C:\\slave\\test\\build\\venv\\lib\\site-packages\\marionette_harness\\runner\\base.py\", line 905, in start_fixture_servers\n if self.appName == \"fennec\":\n\n File \"C:\\slave\\test\\build\\venv\\lib\\site-packages\\marionette_harness\\runner\\base.py\", line 668, in appName\n self._appName = self.capabilities.get('browserName')\n\n File \"C:\\slave\\test\\build\\venv\\lib\\site-packages\\marionette_harness\\runner\\base.py\", line 641, in capabilities\n self.marionette.start_session()\n\n File \"C:\\slave\\test\\build\\venv\\lib\\site-packages\\marionette_driver\\decorators.py\", line 23, in _\n return func(*args, **kwargs)\n\n File \"C:\\slave\\test\\build\\venv\\lib\\site-packages\\marionette_driver\\marionette.py\", line 1273, in start_session\n resp = self._send_message(\"newSession\", body)\n\n File \"C:\\slave\\test\\build\\venv\\lib\\site-packages\\marionette_driver\\decorators.py\", line 28, in _\n m._handle_socket_failure()\n\n File \"C:\\slave\\test\\build\\venv\\lib\\site-packages\\marionette_driver\\decorators.py\", line 23, in _\n return func(*args, **kwargs)\n\n File \"C:\\slave\\test\\build\\venv\\lib\\site-packages\\marionette_driver\\marionette.py\", line 710, in _send_message\n msg = self.client.request(name, params)\n\n File \"C:\\slave\\test\\build\\venv\\lib\\site-packages\\marionette_driver\\transport.py\", line 284, in request\n return self.receive()\n\n File \"C:\\slave\\test\\build\\venv\\lib\\site-packages\\marionette_driver\\transport.py\", line 211, in receive\n raise socket.timeout(\"Connection timed out after {}s\".format(self.socket_timeout))\n\nIOError: Process killed because the connection to Marionette server is lost. Check gecko.log for errors (Reason: Connection timed out after 60.0s)\n"} 08:25:16 ERROR - Return code: 1 08:25:16 INFO - TinderboxPrint: marionette
T-FAIL 08:25:16 INFO - gecko.log not found 08:25:16 INFO - TinderboxPrint: marionette
T-FAIL 08:25:16 INFO - Marionette exited with return code 1: FAILURE 08:25:16 ERROR - # TBPL FAILURE # 08:25:16 WARNING - setting return code to 2 08:25:16 INFO - Running post-action listener: _resource_record_post_action 08:25:16 INFO - [mozharness: 2016-12-22 16:25:16.150000Z] Finished run-tests step (success) 08:25:16 INFO - Running post-run listener: _resource_record_post_run 08:25:16 INFO - Total resource usage - Wall time: 137s; CPU: 2.0%; Read bytes: 89726976; Write bytes: 157126656; Read time: 1406660; Write time: 199909 08:25:16 INFO - TinderboxPrint: CPU usage
2.1% 08:25:16 INFO - TinderboxPrint: I/O read bytes / time
89,726,976 / 1,406,660 08:25:16 INFO - TinderboxPrint: I/O write bytes / time
157,126,656 / 199,909 08:25:16 INFO - TinderboxPrint: CPU idle
1,071.3 (97.9%) 08:25:16 INFO - TinderboxPrint: CPU user
16.8 (1.5%) 08:25:16 INFO - install - Wall time: 3s; CPU: 10.0%; Read bytes: 0; Write bytes: 128930304; Read time: 0; Write time: 112884 08:25:16 INFO - run-tests - Wall time: 134s; CPU: 2.0%; Read bytes: 89504768; Write bytes: 23109120; Read time: 1386661; Write time: 81881 08:25:16 WARNING - could not upload resource usage JSON 08:25:16 WARNING - Traceback (most recent call last): 08:25:16 WARNING - 08:25:16 WARNING - File "C:\slave\test\scripts\mozharness\base\python.py", line 623, in _resource_record_post_run 08:25:16 WARNING - json.dump(self._resource_monitor.as_dict(), fh, 08:25:16 WARNING - 08:25:16 WARNING - File "C:\slave\test\build\venv\Lib\site-packages\mozsystemmonitor\resourcemonitor.py", line 663, in as_dict 08:25:16 WARNING - cpu_logical_count=psutil.cpu_count(logical=True), 08:25:16 WARNING - 08:25:16 WARNING - AttributeError: 'module' object has no attribute 'cpu_count' 08:25:16 WARNING - 08:25:16 INFO - Running post-run listener: _upload_blobber_files 08:25:16 INFO - Blob upload gear active. 08:25:16 INFO - Preparing to upload files from C:\slave\test\build\blobber_upload_dir. 08:25:16 INFO - Files from C:\slave\test\build\blobber_upload_dir are to be uploaded with branch at the following location(s): https://blobupload.elasticbeanstalk.com 08:25:16 INFO - Running command: ['C:\\slave\\test\\build\\venv\\Scripts\\python', 'C:\\slave\\test\\build\\venv\\Scripts\\blobberc.py', '-u', 'https://blobupload.elasticbeanstalk.com', '-a', 'C:\\slave\\test\\oauth.txt', '-b', 'mozilla-aurora', '-d', 'C:\\slave\\test\\build\\blobber_upload_dir', '--output-manifest', 'C:\\slave\\test\\build\\uploaded_files.json'] 08:25:16 INFO - Copy/paste: C:\slave\test\build\venv\Scripts\python C:\slave\test\build\venv\Scripts\blobberc.py -u https://blobupload.elasticbeanstalk.com -a C:\slave\test\oauth.txt -b mozilla-aurora -d C:\slave\test\build\blobber_upload_dir --output-manifest C:\slave\test\build\uploaded_files.json 08:25:16 INFO - (blobuploader) - INFO - Open directory for files ... 08:25:16 INFO - (blobuploader) - INFO - Uploading C:\slave\test\build\blobber_upload_dir\gecko.log ... 08:25:16 INFO - (blobuploader) - INFO - Using https://blobupload.elasticbeanstalk.com 08:25:16 INFO - (blobuploader) - INFO - Uploading, attempt #1. 08:25:17 INFO - (blobuploader) - INFO - TinderboxPrint: gecko.log: uploaded 08:25:17 INFO - (blobuploader) - INFO - Blobserver returned 202. File uploaded! 08:25:17 INFO - (blobuploader) - INFO - Done attempting. 08:25:17 INFO - (blobuploader) - INFO - Uploading C:\slave\test\build\blobber_upload_dir\marionette_errorsummary.log ... 08:25:17 INFO - (blobuploader) - INFO - Using https://blobupload.elasticbeanstalk.com 08:25:17 INFO - (blobuploader) - INFO - Uploading, attempt #1. 08:25:18 INFO - (blobuploader) - INFO - TinderboxPrint: marionette_errorsummary.log: uploaded 08:25:18 INFO - (blobuploader) - INFO - Blobserver returned 202. File uploaded! 08:25:18 INFO - (blobuploader) - INFO - Done attempting. 08:25:18 INFO - (blobuploader) - INFO - Uploading C:\slave\test\build\blobber_upload_dir\marionette_raw.log ... 08:25:18 INFO - (blobuploader) - INFO - Using https://blobupload.elasticbeanstalk.com 08:25:18 INFO - (blobuploader) - INFO - Uploading, attempt #1. 08:25:19 INFO - (blobuploader) - INFO - TinderboxPrint: marionette_raw.log: uploaded 08:25:19 INFO - (blobuploader) - INFO - Blobserver returned 202. File uploaded! 08:25:19 INFO - (blobuploader) - INFO - Done attempting. 08:25:19 INFO - (blobuploader) - INFO - Uploading C:\slave\test\build\blobber_upload_dir\report.html ... 08:25:19 INFO - (blobuploader) - INFO - Using https://blobupload.elasticbeanstalk.com 08:25:19 INFO - (blobuploader) - INFO - Uploading, attempt #1. 08:25:19 INFO - (blobuploader) - INFO - TinderboxPrint: report.html: uploaded 08:25:19 INFO - (blobuploader) - INFO - Blobserver returned 202. File uploaded! 08:25:19 INFO - (blobuploader) - INFO - Done attempting. 08:25:19 INFO - (blobuploader) - INFO - Uploading C:\slave\test\build\blobber_upload_dir\resource-usage.json ... 08:25:19 INFO - (blobuploader) - INFO - Using https://blobupload.elasticbeanstalk.com 08:25:19 INFO - (blobuploader) - INFO - Uploading, attempt #1. 08:25:20 INFO - (blobuploader) - INFO - TinderboxPrint: resource-usage.json: uploaded 08:25:20 INFO - (blobuploader) - INFO - Blobserver returned 202. File uploaded! 08:25:20 INFO - (blobuploader) - INFO - Done attempting. 08:25:20 INFO - (blobuploader) - INFO - Iteration through files over. 08:25:20 INFO - Return code: 0 08:25:20 INFO - rmtree: C:\slave\test\build\uploaded_files.json 08:25:20 INFO - Using _rmtree_windows ... 08:25:20 INFO - retry: Calling _rmtree_windows with args: ('C:\\slave\\test\\build\\uploaded_files.json',), kwargs: {}, attempt #1 08:25:20 INFO - Setting buildbot property blobber_files to {"report.html": "http://mozilla-releng-blobs.s3.amazonaws.com/blobs/mozilla-aurora/sha512/46046a77eeebde579194f78ee247c5c858dc876ab23b2b2dfc75f4c503c86e977b1fae229370323fe18ddaa92531bbc3f74c6cd90a5998169ec36f7eb55ac96d", "resource-usage.json": "http://mozilla-releng-blobs.s3.amazonaws.com/blobs/mozilla-aurora/sha512/cf83e1357eefb8bdf1542850d66d8007d620e4050b5715dc83f4a921d36ce9ce47d0d13c5d85f2b0ff8318d2877eec2f63b931bd47417a81a538327af927da3e", "gecko.log": "http://mozilla-releng-blobs.s3.amazonaws.com/blobs/mozilla-aurora/sha512/d4d01a323cd15e1bc53f264fc4693d2127ac412ee3ccdb329fe6da889a18c4ae6c0ffa3708ba388404c1f5d8d25d2b0aadbc7453cfc83784d842269fab71d29a", "marionette_raw.log": "http://mozilla-releng-blobs.s3.amazonaws.com/blobs/mozilla-aurora/sha512/b9bcbe19b7d9d1ec539b8e33c8d1072e830793a3ffed3ac0fc3eefd9496e459a4ea6df05c9053200f1eb71e0905ea9bcea31aa481baef050106b47f46f9cc258", "marionette_errorsummary.log": "http://mozilla-releng-blobs.s3.amazonaws.com/blobs/mozilla-aurora/sha512/9332f64b7d83b61f63a7151cd376042874050c6f2e6396e7fc193076ffb12bcbee905825350eeb5dbbf44d76158c58129795976f131d42373f0231c467527e90"} 08:25:20 INFO - Writing buildbot properties ['blobber_files'] to C:\slave\test\properties\blobber_files 08:25:20 INFO - Writing to file C:\slave\test\properties\blobber_files 08:25:20 INFO - Contents: 08:25:20 INFO - blobber_files:{"report.html": "http://mozilla-releng-blobs.s3.amazonaws.com/blobs/mozilla-aurora/sha512/46046a77eeebde579194f78ee247c5c858dc876ab23b2b2dfc75f4c503c86e977b1fae229370323fe18ddaa92531bbc3f74c6cd90a5998169ec36f7eb55ac96d", "resource-usage.json": "http://mozilla-releng-blobs.s3.amazonaws.com/blobs/mozilla-aurora/sha512/cf83e1357eefb8bdf1542850d66d8007d620e4050b5715dc83f4a921d36ce9ce47d0d13c5d85f2b0ff8318d2877eec2f63b931bd47417a81a538327af927da3e", "gecko.log": "http://mozilla-releng-blobs.s3.amazonaws.com/blobs/mozilla-aurora/sha512/d4d01a323cd15e1bc53f264fc4693d2127ac412ee3ccdb329fe6da889a18c4ae6c0ffa3708ba388404c1f5d8d25d2b0aadbc7453cfc83784d842269fab71d29a", "marionette_raw.log": "http://mozilla-releng-blobs.s3.amazonaws.com/blobs/mozilla-aurora/sha512/b9bcbe19b7d9d1ec539b8e33c8d1072e830793a3ffed3ac0fc3eefd9496e459a4ea6df05c9053200f1eb71e0905ea9bcea31aa481baef050106b47f46f9cc258", "marionette_errorsummary.log": "http://mozilla-releng-blobs.s3.amazonaws.com/blobs/mozilla-aurora/sha512/9332f64b7d83b61f63a7151cd376042874050c6f2e6396e7fc193076ffb12bcbee905825350eeb5dbbf44d76158c58129795976f131d42373f0231c467527e90"} 08:25:20 INFO - Running post-run listener: copy_logs_to_upload_dir 08:25:20 INFO - Copying logs to upload dir... 08:25:20 INFO - mkdir: C:\slave\test\build\upload\logs 08:25:20 INFO - Copying logs to upload dir... 08:25:20 INFO - Using _rmtree_windows ... 08:25:20 INFO - Using _rmtree_windows ... 08:25:20 INFO - Using _rmtree_windows ... 08:25:20 INFO - Using _rmtree_windows ... 08:25:20 INFO - Using _rmtree_windows ... 08:25:20 INFO - Using _rmtree_windows ... 08:25:20 INFO - Using _rmtree_windows ... 08:25:20 WARNING - returning nonzero exit status 2 program finished with exit code 2 elapsedTime=244.455000 ========= master_lag: 0.02 ========= ========= Finished 'c:/mozilla-build/python27/python -u ...' failed (results: 2, elapsed: 4 mins, 4 secs) (at 2016-12-22 08:25:20.899051) ========= ========= Started set props: build_url blobber_files (results: 0, elapsed: 0 secs) (at 2016-12-22 08:25:20.905529) ========= 'cmd' '/C' 'for' '%f' 'in' '(*)' 'do' '@type' '%f' in dir C:\slave\test\properties (timeout 1200 secs) watching logfiles {} argv: ['cmd', '/C', 'for', '%f', 'in', '(*)', 'do', '@type', '%f'] environment: ALLUSERSPROFILE=C:\Documents and Settings\All Users APPDATA=C:\Documents and Settings\cltbld.T-XP32-IX-022\Application Data COMMONPROGRAMFILES=C:\Program Files\Common Files COMPUTERNAME=T-XP32-IX-022 COMSPEC=C:\WINDOWS\system32\cmd.exe DCLOCATION=SCL3 DNSSUFFIX=wintest.releng.scl3.mozilla.com FP_NO_HOST_CHECK=NO HOMEDRIVE=C: HOMEPATH=\Documents and Settings\cltbld.T-XP32-IX-022 KTS_HOME=C:\Program Files\KTS KTS_VERSION=1.19c LOGONSERVER=\\T-XP32-IX-022 MONDIR=C:\Monitor_config\ MOZBUILDDIR=C:\mozilla-build\ NUMBER_OF_PROCESSORS=8 OS=Windows_NT OURDRIVE=C: PATH=C:\Program Files\NVIDIA Corporation\PhysX\Common;C:\WINDOWS\system32;C:\WINDOWS;C:\WINDOWS\System32\Wbem;C:\WINDOWS\system32\WindowsPowerShell\v1.0;C:\mozilla-build\python27;C:\mozilla-build\python27\Scripts;C:\mozilla-build\msys\bin;C:\mozilla-build\vim\vim72;C:\mozilla-build\wget;C:\mozilla-build\info-zip;C:\CoreUtils\bin;C:\mozilla-build\buildbotve\scripts;C:\mozilla-build\hg PATHEXT=.COM;.EXE;.BAT;.CMD;.VBS;.VBE;.JS;.JSE;.WSF;.WSH;.PSC1 PROCESSOR_ARCHITECTURE=x86 PROCESSOR_IDENTIFIER=x86 Family 6 Model 30 Stepping 5, GenuineIntel PROCESSOR_LEVEL=6 PROCESSOR_REVISION=1e05 PROGRAMFILES=C:\Program Files PROMPT=$P$G PWD=C:\slave\test\properties RUNLOGFILE=C:\slave\\runslave.log SESSIONNAME=Console SLAVEDIR=C:\slave\ SYSTEMDRIVE=C: SYSTEMROOT=C:\WINDOWS TEMP=C:\DOCUME~1\CLTBLD~1.T-X\LOCALS~1\Temp TEST1=testie TMP=C:\DOCUME~1\CLTBLD~1.T-X\LOCALS~1\Temp USERDOMAIN=T-XP32-IX-022 USERNAME=cltbld USERPROFILE=C:\Documents and Settings\cltbld.T-XP32-IX-022 WINDIR=C:\WINDOWS using PTY: False blobber_files:{"report.html": "http://mozilla-releng-blobs.s3.amazonaws.com/blobs/mozilla-aurora/sha512/46046a77eeebde579194f78ee247c5c858dc876ab23b2b2dfc75f4c503c86e977b1fae229370323fe18ddaa92531bbc3f74c6cd90a5998169ec36f7eb55ac96d", "resource-usage.json": "http://mozilla-releng-blobs.s3.amazonaws.com/blobs/mozilla-aurora/sha512/cf83e1357eefb8bdf1542850d66d8007d620e4050b5715dc83f4a921d36ce9ce47d0d13c5d85f2b0ff8318d2877eec2f63b931bd47417a81a538327af927da3e", "gecko.log": "http://mozilla-releng-blobs.s3.amazonaws.com/blobs/mozilla-aurora/sha512/d4d01a323cd15e1bc53f264fc4693d2127ac412ee3ccdb329fe6da889a18c4ae6c0ffa3708ba388404c1f5d8d25d2b0aadbc7453cfc83784d842269fab71d29a", "marionette_raw.log": "http://mozilla-releng-blobs.s3.amazonaws.com/blobs/mozilla-aurora/sha512/b9bcbe19b7d9d1ec539b8e33c8d1072e830793a3ffed3ac0fc3eefd9496e459a4ea6df05c9053200f1eb71e0905ea9bcea31aa481baef050106b47f46f9cc258", "marionette_errorsummary.log": "http://mozilla-releng-blobs.s3.amazonaws.com/blobs/mozilla-aurora/sha512/9332f64b7d83b61f63a7151cd376042874050c6f2e6396e7fc193076ffb12bcbee905825350eeb5dbbf44d76158c58129795976f131d42373f0231c467527e90"} build_url:https://queue.taskcluster.net/v1/task/VyPEbHbKTuCa6riT6uy3nQ/artifacts/public/build/firefox-52.0a2.en-US.win32.zip program finished with exit code 0 elapsedTime=0.109000 build_url: 'https://queue.taskcluster.net/v1/task/VyPEbHbKTuCa6riT6uy3nQ/artifacts/public/build/firefox-52.0a2.en-US.win32.zip' blobber_files: '{"report.html": "http://mozilla-releng-blobs.s3.amazonaws.com/blobs/mozilla-aurora/sha512/46046a77eeebde579194f78ee247c5c858dc876ab23b2b2dfc75f4c503c86e977b1fae229370323fe18ddaa92531bbc3f74c6cd90a5998169ec36f7eb55ac96d", "resource-usage.json": "http://mozilla-releng-blobs.s3.amazonaws.com/blobs/mozilla-aurora/sha512/cf83e1357eefb8bdf1542850d66d8007d620e4050b5715dc83f4a921d36ce9ce47d0d13c5d85f2b0ff8318d2877eec2f63b931bd47417a81a538327af927da3e", "gecko.log": "http://mozilla-releng-blobs.s3.amazonaws.com/blobs/mozilla-aurora/sha512/d4d01a323cd15e1bc53f264fc4693d2127ac412ee3ccdb329fe6da889a18c4ae6c0ffa3708ba388404c1f5d8d25d2b0aadbc7453cfc83784d842269fab71d29a", "marionette_raw.log": "http://mozilla-releng-blobs.s3.amazonaws.com/blobs/mozilla-aurora/sha512/b9bcbe19b7d9d1ec539b8e33c8d1072e830793a3ffed3ac0fc3eefd9496e459a4ea6df05c9053200f1eb71e0905ea9bcea31aa481baef050106b47f46f9cc258", "marionette_errorsummary.log": "http://mozilla-releng-blobs.s3.amazonaws.com/blobs/mozilla-aurora/sha512/9332f64b7d83b61f63a7151cd376042874050c6f2e6396e7fc193076ffb12bcbee905825350eeb5dbbf44d76158c58129795976f131d42373f0231c467527e90"}' ========= master_lag: 0.01 ========= ========= Finished set props: build_url blobber_files (results: 0, elapsed: 0 secs) (at 2016-12-22 08:25:21.026279) ========= ========= Started 'rm -f ...' (results: 0, elapsed: 0 secs) (at 2016-12-22 08:25:21.026647) ========= 'rm' '-f' 'oauth.txt' in dir C:\slave\test\. (timeout 1200 secs) watching logfiles {} argv: ['rm', '-f', 'oauth.txt'] environment: ALLUSERSPROFILE=C:\Documents and Settings\All Users APPDATA=C:\Documents and Settings\cltbld.T-XP32-IX-022\Application Data COMMONPROGRAMFILES=C:\Program Files\Common Files COMPUTERNAME=T-XP32-IX-022 COMSPEC=C:\WINDOWS\system32\cmd.exe DCLOCATION=SCL3 DNSSUFFIX=wintest.releng.scl3.mozilla.com FP_NO_HOST_CHECK=NO HOMEDRIVE=C: HOMEPATH=\Documents and Settings\cltbld.T-XP32-IX-022 KTS_HOME=C:\Program Files\KTS KTS_VERSION=1.19c LOGONSERVER=\\T-XP32-IX-022 MONDIR=C:\Monitor_config\ MOZBUILDDIR=C:\mozilla-build\ NUMBER_OF_PROCESSORS=8 OS=Windows_NT OURDRIVE=C: PATH=C:\Program Files\NVIDIA Corporation\PhysX\Common;C:\WINDOWS\system32;C:\WINDOWS;C:\WINDOWS\System32\Wbem;C:\WINDOWS\system32\WindowsPowerShell\v1.0;C:\mozilla-build\python27;C:\mozilla-build\python27\Scripts;C:\mozilla-build\msys\bin;C:\mozilla-build\vim\vim72;C:\mozilla-build\wget;C:\mozilla-build\info-zip;C:\CoreUtils\bin;C:\mozilla-build\buildbotve\scripts;C:\mozilla-build\hg PATHEXT=.COM;.EXE;.BAT;.CMD;.VBS;.VBE;.JS;.JSE;.WSF;.WSH;.PSC1 PROCESSOR_ARCHITECTURE=x86 PROCESSOR_IDENTIFIER=x86 Family 6 Model 30 Stepping 5, GenuineIntel PROCESSOR_LEVEL=6 PROCESSOR_REVISION=1e05 PROGRAMFILES=C:\Program Files PROMPT=$P$G PWD=C:\slave\test RUNLOGFILE=C:\slave\\runslave.log SESSIONNAME=Console SLAVEDIR=C:\slave\ SYSTEMDRIVE=C: SYSTEMROOT=C:\WINDOWS TEMP=C:\DOCUME~1\CLTBLD~1.T-X\LOCALS~1\Temp TEST1=testie TMP=C:\DOCUME~1\CLTBLD~1.T-X\LOCALS~1\Temp USERDOMAIN=T-XP32-IX-022 USERNAME=cltbld USERPROFILE=C:\Documents and Settings\cltbld.T-XP32-IX-022 WINDIR=C:\WINDOWS using PTY: False program finished with exit code 0 elapsedTime=0.109000 ========= master_lag: 0.00 ========= ========= Finished 'rm -f ...' (results: 0, elapsed: 0 secs) (at 2016-12-22 08:25:21.137961) ========= ========= Started reboot slave lost (results: 0, elapsed: 0 secs) (at 2016-12-22 08:25:21.138288) ========= ========= Finished reboot slave lost (results: 0, elapsed: 0 secs) (at 2016-12-22 08:25:21.559850) ========= ========= Total master_lag: 0.09 =========