builder: fx-team_ubuntu64-asan_vm_test-mochitest-clipboard slave: tst-linux64-spot-1649 starttime: 1464196459.3 results: failure (2) buildid: 20160525091547 builduid: c0ae127e15874a72a6a80a0473400de8 revision: 5444f0c1e3301076fa86e566eec58d89f5329aec ========= Started set props: master (results: 0, elapsed: 0 secs) (at 2016-05-25 10:14:19.302181) ========= master: http://buildbot-master130.bb.releng.use1.mozilla.com:8201/ ========= Finished set props: master (results: 0, elapsed: 0 secs) (at 2016-05-25 10:14:19.302640) ========= ========= Started downloading to buildprops.json (results: 0, elapsed: 0 secs) (at 2016-05-25 10:14:19.302949) ========= ========= Finished downloading to buildprops.json (results: 0, elapsed: 0 secs) (at 2016-05-25 10:14:19.341887) ========= ========= Started 'bash -c ...' (results: 0, elapsed: 0 secs) (at 2016-05-25 10:14:19.342214) ========= bash -c 'wget -Oarchiver_client.py --no-check-certificate --tries=10 --waitretry=3 https://hg.mozilla.org/build/tools/raw-file/default/buildfarm/utils/archiver_client.py' in dir /builds/slave/test/. (timeout 1200 secs) watching logfiles {} argv: ['bash', '-c', 'wget -Oarchiver_client.py --no-check-certificate --tries=10 --waitretry=3 https://hg.mozilla.org/build/tools/raw-file/default/buildfarm/utils/archiver_client.py'] environment: HOME=/home/cltbld LANG=en_US.UTF-8 LOGNAME=cltbld MAIL=/var/mail/cltbld NODE_PATH=/usr/lib/nodejs:/usr/lib/node_modules:/usr/share/javascript PATH=/usr/local/bin:/usr/local/bin:/usr/bin:/bin:/usr/local/games:/usr/games PWD=/builds/slave/test SHELL=/bin/bash SHLVL=1 TERM=linux TMOUT=86400 USER=cltbld XDG_SESSION_COOKIE=9ca12473fbb1d023794ffd180000023c-1464192605.912671-1195279248 _=/tools/buildbot/bin/python using PTY: False --2016-05-25 10:14:19-- https://hg.mozilla.org/build/tools/raw-file/default/buildfarm/utils/archiver_client.py Resolving hg.mozilla.org (hg.mozilla.org)... 63.245.215.102, 63.245.215.25 Connecting to hg.mozilla.org (hg.mozilla.org)|63.245.215.102|:443... connected. HTTP request sent, awaiting response... 200 Script output follows Length: 12141 (12K) [text/x-python] Saving to: `archiver_client.py' 0K .......... . 100% 13.9M=0.001s 2016-05-25 10:14:19 (13.9 MB/s) - `archiver_client.py' saved [12141/12141] program finished with exit code 0 elapsedTime=0.566055 ========= master_lag: 0.03 ========= ========= Finished 'bash -c ...' (results: 0, elapsed: 0 secs) (at 2016-05-25 10:14:19.941416) ========= ========= Started 'rm -rf ...' (results: 0, elapsed: 0 secs) (at 2016-05-25 10:14:19.941742) ========= rm -rf scripts properties in dir /builds/slave/test/. (timeout 1200 secs) watching logfiles {} argv: ['rm', '-rf', 'scripts', 'properties'] environment: HOME=/home/cltbld LANG=en_US.UTF-8 LOGNAME=cltbld MAIL=/var/mail/cltbld NODE_PATH=/usr/lib/nodejs:/usr/lib/node_modules:/usr/share/javascript PATH=/usr/local/bin:/usr/local/bin:/usr/bin:/bin:/usr/local/games:/usr/games PWD=/builds/slave/test SHELL=/bin/bash SHLVL=1 TERM=linux TMOUT=86400 USER=cltbld XDG_SESSION_COOKIE=9ca12473fbb1d023794ffd180000023c-1464192605.912671-1195279248 _=/tools/buildbot/bin/python using PTY: False program finished with exit code 0 elapsedTime=0.074641 ========= master_lag: 0.03 ========= ========= Finished 'rm -rf ...' (results: 0, elapsed: 0 secs) (at 2016-05-25 10:14:20.046582) ========= ========= Started 'bash -c ...' (results: 0, elapsed: 2 secs) (at 2016-05-25 10:14:20.046951) ========= bash -c 'python archiver_client.py mozharness --repo integration/fx-team --rev 5444f0c1e3301076fa86e566eec58d89f5329aec --destination scripts --debug' in dir /builds/slave/test/. (timeout 1200 secs) watching logfiles {} argv: ['bash', '-c', u'python archiver_client.py mozharness --repo integration/fx-team --rev 5444f0c1e3301076fa86e566eec58d89f5329aec --destination scripts --debug'] environment: HOME=/home/cltbld LANG=en_US.UTF-8 LOGNAME=cltbld MAIL=/var/mail/cltbld NODE_PATH=/usr/lib/nodejs:/usr/lib/node_modules:/usr/share/javascript PATH=/usr/local/bin:/usr/local/bin:/usr/bin:/bin:/usr/local/games:/usr/games PWD=/builds/slave/test SHELL=/bin/bash SHLVL=1 TERM=linux TMOUT=86400 USER=cltbld XDG_SESSION_COOKIE=9ca12473fbb1d023794ffd180000023c-1464192605.912671-1195279248 _=/tools/buildbot/bin/python using PTY: False 2016-05-25 10:14:20,222 truncating revision to first 12 chars 2016-05-25 10:14:20,223 Setting DEBUG logging. 2016-05-25 10:14:20,223 attempt 1/10 2016-05-25 10:14:20,223 Getting archive location from https://api.pub.build.mozilla.org/archiver/hgmo/integration/fx-team/5444f0c1e330?&preferred_region=us-west-2&suffix=tar.gz&subdir=testing/mozharness 2016-05-25 10:14:21,539 unpacking tar archive at: fx-team-5444f0c1e330/testing/mozharness/ program finished with exit code 0 elapsedTime=1.976825 ========= master_lag: 0.06 ========= ========= Finished 'bash -c ...' (results: 0, elapsed: 2 secs) (at 2016-05-25 10:14:22.088240) ========= ========= Started set props: script_repo_revision (results: 0, elapsed: 0 secs) (at 2016-05-25 10:14:22.088568) ========= script_repo_revision: 5444f0c1e3301076fa86e566eec58d89f5329aec ========= Finished set props: script_repo_revision (results: 0, elapsed: 0 secs) (at 2016-05-25 10:14:22.088978) ========= ========= Started downloading to oauth.txt (results: 0, elapsed: 0 secs) (at 2016-05-25 10:14:22.089258) ========= ========= Finished downloading to oauth.txt (results: 0, elapsed: 0 secs) (at 2016-05-25 10:14:22.117785) ========= ========= Started '/tools/buildbot/bin/python scripts/scripts/desktop_unittest.py ...' failed (results: 2, elapsed: 3 mins, 58 secs) (at 2016-05-25 10:14:22.118084) ========= /tools/buildbot/bin/python scripts/scripts/desktop_unittest.py --cfg unittests/linux_unittest.py --mochitest-suite plain-clipboard,chrome-clipboard,browser-chrome-clipboard,jetpack-package-clipboard --blob-upload-branch fx-team --download-symbols ondemand in dir /builds/slave/test/. (timeout 1800 secs) (maxTime 7200 secs) watching logfiles {} argv: ['/tools/buildbot/bin/python', 'scripts/scripts/desktop_unittest.py', '--cfg', 'unittests/linux_unittest.py', '--mochitest-suite', 'plain-clipboard,chrome-clipboard,browser-chrome-clipboard,jetpack-package-clipboard', '--blob-upload-branch', 'fx-team', '--download-symbols', 'ondemand'] environment: DISPLAY=:0 HOME=/home/cltbld LANG=en_US.UTF-8 LOGNAME=cltbld MAIL=/var/mail/cltbld NODE_PATH=/usr/lib/nodejs:/usr/lib/node_modules:/usr/share/javascript PATH=/usr/local/bin:/usr/local/bin:/usr/bin:/bin:/usr/local/games:/usr/games PROPERTIES_FILE=/builds/slave/test/buildprops.json PWD=/builds/slave/test SHELL=/bin/bash SHLVL=1 TERM=linux TMOUT=86400 USER=cltbld XDG_SESSION_COOKIE=9ca12473fbb1d023794ffd180000023c-1464192605.912671-1195279248 _=/tools/buildbot/bin/python using PTY: False 10:14:22 INFO - MultiFileLogger online at 20160525 10:14:22 in /builds/slave/test 10:14:22 INFO - Run as scripts/scripts/desktop_unittest.py --cfg unittests/linux_unittest.py --mochitest-suite plain-clipboard,chrome-clipboard,browser-chrome-clipboard,jetpack-package-clipboard --blob-upload-branch fx-team --download-symbols ondemand 10:14:22 INFO - Dumping config to /builds/slave/test/logs/localconfig.json. 10:14:22 INFO - {'all_cppunittest_suites': {'cppunittest': {'tests': ('tests/cppunittest',)}}, 10:14:22 INFO - 'all_gtest_suites': {'gtest': ()}, 10:14:22 INFO - 'all_jittest_suites': {'jittest': (), 10:14:22 INFO - 'jittest-chunked': (), 10:14:22 INFO - 'jittest1': ('--total-chunks=2', '--this-chunk=1'), 10:14:22 INFO - 'jittest2': ('--total-chunks=2', '--this-chunk=2')}, 10:14:22 INFO - 'all_mochitest_suites': {'a11y': ('--a11y',), 10:14:22 INFO - 'browser-chrome': ('--browser-chrome',), 10:14:22 INFO - 'browser-chrome-addons': ('--browser-chrome', 10:14:22 INFO - '--chunk-by-runtime', 10:14:22 INFO - '--tag=addons'), 10:14:22 INFO - 'browser-chrome-chunked': ('--browser-chrome', 10:14:22 INFO - '--chunk-by-runtime'), 10:14:22 INFO - 'browser-chrome-clipboard': ('--browser-chrome', 10:14:22 INFO - '--subsuite=clipboard'), 10:14:22 INFO - 'browser-chrome-coverage': ('--browser-chrome', 10:14:22 INFO - '--chunk-by-runtime', 10:14:22 INFO - '--timeout=1200'), 10:14:22 INFO - 'browser-chrome-gpu': ('--browser-chrome', 10:14:22 INFO - '--subsuite=gpu'), 10:14:22 INFO - 'browser-chrome-screenshots': ('--browser-chrome', 10:14:22 INFO - '--subsuite=screenshots'), 10:14:22 INFO - 'chrome': ('--chrome',), 10:14:22 INFO - 'chrome-chunked': ('--chrome', '--chunk-by-dir=4'), 10:14:22 INFO - 'chrome-clipboard': ('--chrome', 10:14:22 INFO - '--subsuite=clipboard'), 10:14:22 INFO - 'chrome-gpu': ('--chrome', '--subsuite=gpu'), 10:14:22 INFO - 'jetpack-addon': ('--jetpack-addon',), 10:14:22 INFO - 'jetpack-package': ('--jetpack-package',), 10:14:22 INFO - 'jetpack-package-clipboard': ('--jetpack-package', 10:14:22 INFO - '--subsuite=clipboard'), 10:14:22 INFO - 'mochitest-devtools-chrome': ('--browser-chrome', 10:14:22 INFO - '--subsuite=devtools'), 10:14:22 INFO - 'mochitest-devtools-chrome-chunked': ('--browser-chrome', 10:14:22 INFO - '--subsuite=devtools', 10:14:22 INFO - '--chunk-by-runtime'), 10:14:22 INFO - 'mochitest-gl': ('--subsuite=webgl',), 10:14:22 INFO - 'mochitest-media': ('--subsuite=media',), 10:14:22 INFO - 'plain': (), 10:14:22 INFO - 'plain-chunked': ('--chunk-by-dir=4',), 10:14:22 INFO - 'plain-clipboard': ('--subsuite=clipboard',), 10:14:22 INFO - 'plain-gpu': ('--subsuite=gpu',), 10:14:22 INFO - 'valgrind-plain': ('--valgrind=/usr/bin/valgrind', 10:14:22 INFO - '--valgrind-supp-files=/builds/slave/test/build/tests/mochitest/x86_64-redhat-linux-gnu.sup,/builds/slave/test/build/tests/mochitest/cross-architecture.sup', 10:14:22 INFO - '--timeout=900', 10:14:22 INFO - '--max-timeouts=50')}, 10:14:22 INFO - 'all_mozbase_suites': {'mozbase': ()}, 10:14:22 INFO - 'all_reftest_suites': {'crashtest': {'options': ('--suite=crashtest',), 10:14:22 INFO - 'tests': ('tests/reftest/tests/testing/crashtest/crashtests.list',)}, 10:14:22 INFO - 'crashtest-ipc': {'env': {'MOZ_DISABLE_CONTEXT_SHARING_GLX': '1', 10:14:22 INFO - 'MOZ_OMTC_ENABLED': '1'}, 10:14:22 INFO - 'options': ('--suite=crashtest', 10:14:22 INFO - '--setpref=browser.tabs.remote=true', 10:14:22 INFO - '--setpref=browser.tabs.remote.autostart=true', 10:14:22 INFO - '--setpref=extensions.e10sBlocksEnabling=false', 10:14:22 INFO - '--setpref=layers.async-pan-zoom.enabled=true'), 10:14:22 INFO - 'tests': ('tests/reftest/tests/testing/crashtest/crashtests.list',)}, 10:14:22 INFO - 'jsreftest': {'options': ('--extra-profile-file=tests/jsreftest/tests/user.js', 10:14:22 INFO - '--suite=jstestbrowser'), 10:14:22 INFO - 'tests': ('tests/jsreftest/tests/jstests.list',)}, 10:14:22 INFO - 'reftest': {'options': ('--suite=reftest',), 10:14:22 INFO - 'tests': ('tests/reftest/tests/layout/reftests/reftest.list',)}, 10:14:22 INFO - 'reftest-ipc': {'env': {'MOZ_DISABLE_CONTEXT_SHARING_GLX': '1', 10:14:22 INFO - 'MOZ_OMTC_ENABLED': '1'}, 10:14:22 INFO - 'options': ('--suite=reftest', 10:14:22 INFO - '--setpref=browser.tabs.remote=true', 10:14:22 INFO - '--setpref=browser.tabs.remote.autostart=true', 10:14:22 INFO - '--setpref=extensions.e10sBlocksEnabling=false', 10:14:22 INFO - '--setpref=layers.async-pan-zoom.enabled=true'), 10:14:22 INFO - 'tests': ('tests/reftest/tests/layout/reftests/reftest-sanity/reftest.list',)}, 10:14:22 INFO - 'reftest-no-accel': {'options': ('--suite=reftest', 10:14:22 INFO - '--setpref=layers.acceleration.force-enabled=disabled'), 10:14:22 INFO - 'tests': ('tests/reftest/tests/layout/reftests/reftest.list',)}}, 10:14:22 INFO - 'all_xpcshell_suites': {'xpcshell': {'options': ('--xpcshell=%(abs_app_dir)s/xpcshell', 10:14:22 INFO - '--manifest=tests/xpcshell/tests/xpcshell.ini'), 10:14:22 INFO - 'tests': ()}, 10:14:22 INFO - 'xpcshell-addons': {'options': ('--xpcshell=%(abs_app_dir)s/xpcshell', 10:14:22 INFO - '--tag=addons', 10:14:22 INFO - '--manifest=tests/xpcshell/tests/xpcshell.ini'), 10:14:22 INFO - 'tests': ()}}, 10:14:22 INFO - 'append_to_log': False, 10:14:22 INFO - 'base_work_dir': '/builds/slave/test', 10:14:22 INFO - 'binary_path': '/builds/slave/test/build/firefox/firefox-bin', 10:14:22 INFO - 'blob_upload_branch': 'fx-team', 10:14:22 INFO - 'blob_uploader_auth_file': '/builds/slave/test/oauth.txt', 10:14:22 INFO - 'buildbot_json_path': 'buildprops.json', 10:14:22 INFO - 'buildbot_max_log_size': 52428800, 10:14:22 INFO - 'code_coverage': False, 10:14:22 INFO - 'config_files': ('unittests/linux_unittest.py',), 10:14:22 INFO - 'default_blob_upload_servers': ('https://blobupload.elasticbeanstalk.com',), 10:14:22 INFO - 'download_minidump_stackwalk': True, 10:14:22 INFO - 'download_symbols': 'ondemand', 10:14:22 INFO - 'e10s': False, 10:14:22 INFO - 'exe_suffix': '', 10:14:22 INFO - 'exes': {'python': '/tools/buildbot/bin/python', 10:14:22 INFO - 'tooltool.py': '/tools/tooltool.py', 10:14:22 INFO - 'virtualenv': ('/tools/buildbot/bin/python', 10:14:22 INFO - '/tools/misc-python/virtualenv.py')}, 10:14:22 INFO - 'find_links': ('http://pypi.pvt.build.mozilla.org/pub', 10:14:22 INFO - 'http://pypi.pub.build.mozilla.org/pub'), 10:14:22 INFO - 'installer_path': '/builds/slave/test/build/installer.tar.bz2', 10:14:22 INFO - 'log_level': 'info', 10:14:22 INFO - 'log_to_console': True, 10:14:22 INFO - 'minidump_save_path': '%(abs_work_dir)s/../minidumps', 10:14:22 INFO - 'minidump_stackwalk_path': 'linux64-minidump_stackwalk', 10:14:22 INFO - 'minidump_tooltool_manifest_path': 'config/tooltool-manifests/linux64/releng.manifest', 10:14:22 INFO - 'minimum_tests_zip_dirs': ('bin/*', 10:14:22 INFO - 'certs/*', 10:14:22 INFO - 'config/*', 10:14:22 INFO - 'marionette/*', 10:14:22 INFO - 'modules/*', 10:14:22 INFO - 'mozbase/*', 10:14:22 INFO - 'tools/*'), 10:14:22 INFO - 'no_random': False, 10:14:22 INFO - 'opt_config_files': (), 10:14:22 INFO - 'pip_index': False, 10:14:22 INFO - 'preflight_run_cmd_suites': ({'architectures': ('32bit', '64bit'), 10:14:22 INFO - 'cmd': ('xset', 's', 'off', 's', 'reset'), 10:14:22 INFO - 'enabled': True, 10:14:22 INFO - 'halt_on_failure': False, 10:14:22 INFO - 'name': 'disable_screen_saver'}, 10:14:22 INFO - {'architectures': ('32bit',), 10:14:22 INFO - 'cmd': ('python', 10:14:22 INFO - '../scripts/external_tools/mouse_and_screen_resolution.py', 10:14:22 INFO - '--configuration-url', 10:14:22 INFO - 'https://hg.mozilla.org/%(branch)s/raw-file/%(revision)s/testing/machine-configuration.json'), 10:14:22 INFO - 'enabled': False, 10:14:22 INFO - 'halt_on_failure': True, 10:14:22 INFO - 'name': 'run mouse & screen adjustment script'}), 10:14:22 INFO - 'require_test_zip': True, 10:14:22 INFO - 'run_all_suites': False, 10:14:22 INFO - 'run_cmd_checks_enabled': True, 10:14:22 INFO - 'run_file_names': {'cppunittest': 'runcppunittests.py', 10:14:22 INFO - 'gtest': 'rungtests.py', 10:14:22 INFO - 'jittest': 'jit_test.py', 10:14:22 INFO - 'mochitest': 'runtests.py', 10:14:22 INFO - 'mozbase': 'test.py', 10:14:22 INFO - 'mozmill': 'runtestlist.py', 10:14:22 INFO - 'reftest': 'runreftest.py', 10:14:22 INFO - 'xpcshell': 'runxpcshelltests.py'}, 10:14:22 INFO - 'specific_tests_zip_dirs': {'cppunittest': ('cppunittest/*',), 10:14:22 INFO - 'gtest': ('gtest/*',), 10:14:22 INFO - 'jittest': ('jit-test/*',), 10:14:22 INFO - 'mochitest': ('mochitest/*',), 10:14:22 INFO - 'mozbase': ('mozbase/*',), 10:14:22 INFO - 'mozmill': ('mozmill/*',), 10:14:22 INFO - 'reftest': ('reftest/*', 'jsreftest/*'), 10:14:22 INFO - 'xpcshell': ('xpcshell/*',)}, 10:14:22 INFO - 'specified_mochitest_suites': ('plain-clipboard', 10:14:22 INFO - 'chrome-clipboard', 10:14:22 INFO - 'browser-chrome-clipboard', 10:14:22 INFO - 'jetpack-package-clipboard'), 10:14:22 INFO - 'strict_content_sandbox': False, 10:14:22 INFO - 'suite_definitions': {'cppunittest': {'options': ('--symbols-path=%(symbols_path)s', 10:14:22 INFO - '--xre-path=%(abs_app_dir)s'), 10:14:22 INFO - 'run_filename': 'runcppunittests.py', 10:14:22 INFO - 'testsdir': 'cppunittest'}, 10:14:22 INFO - 'gtest': {'options': ('--xre-path=%(abs_res_dir)s', 10:14:22 INFO - '--cwd=%(gtest_dir)s', 10:14:22 INFO - '--symbols-path=%(symbols_path)s', 10:14:22 INFO - '--utility-path=tests/bin', 10:14:22 INFO - '%(binary_path)s'), 10:14:22 INFO - 'run_filename': 'rungtests.py'}, 10:14:22 INFO - 'jittest': {'options': ('tests/bin/js', 10:14:22 INFO - '--no-slow', 10:14:22 INFO - '--no-progress', 10:14:22 INFO - '--format=automation', 10:14:22 INFO - '--jitflags=all'), 10:14:22 INFO - 'run_filename': 'jit_test.py', 10:14:22 INFO - 'testsdir': 'jit-test/jit-test'}, 10:14:22 INFO - 'luciddream-b2gdt': {'options': ('--startup-timeout=300', 10:14:22 INFO - '--log-raw=%(raw_log_file)s', 10:14:22 INFO - '--log-errorsummary=%(error_summary_file)s', 10:14:22 INFO - '--browser-path=%(browser_path)s', 10:14:22 INFO - '--b2g-desktop-path=%(fxos_desktop_path)s', 10:14:22 INFO - '--gaia-profile=%(gaia_profile)s', 10:14:22 INFO - '%(test_manifest)s')}, 10:14:22 INFO - 'luciddream-emulator': {'options': ('--startup-timeout=300', 10:14:22 INFO - '--log-raw=%(raw_log_file)s', 10:14:22 INFO - '--log-errorsummary=%(error_summary_file)s', 10:14:22 INFO - '--browser-path=%(browser_path)s', 10:14:22 INFO - '--b2gpath=%(emulator_path)s', 10:14:22 INFO - '%(test_manifest)s')}, 10:14:22 INFO - 'mochitest': {'options': ('--appname=%(binary_path)s', 10:14:22 INFO - '--utility-path=tests/bin', 10:14:22 INFO - '--extra-profile-file=tests/bin/plugins', 10:14:22 INFO - '--symbols-path=%(symbols_path)s', 10:14:22 INFO - '--certificate-path=tests/certs', 10:14:22 INFO - '--setpref=webgl.force-enabled=true', 10:14:22 INFO - '--quiet', 10:14:22 INFO - '--log-raw=%(raw_log_file)s', 10:14:22 INFO - '--log-errorsummary=%(error_summary_file)s', 10:14:22 INFO - '--use-test-media-devices', 10:14:22 INFO - '--screenshot-on-fail'), 10:14:22 INFO - 'run_filename': 'runtests.py', 10:14:22 INFO - 'testsdir': 'mochitest'}, 10:14:22 INFO - 'mozbase': {'options': ('-b', '%(binary_path)s'), 10:14:22 INFO - 'run_filename': 'test.py', 10:14:22 INFO - 'testsdir': 'mozbase'}, 10:14:22 INFO - 'mozmill': {'options': ('--binary=%(binary_path)s', 10:14:22 INFO - '--testing-modules-dir=test/modules', 10:14:22 INFO - '--plugins-path=%(test_plugin_path)s', 10:14:22 INFO - '--symbols-path=%(symbols_path)s'), 10:14:22 INFO - 'run_filename': 'runtestlist.py', 10:14:22 INFO - 'testsdir': 'mozmill'}, 10:14:22 INFO - 'reftest': {'options': ('--appname=%(binary_path)s', 10:14:22 INFO - '--utility-path=tests/bin', 10:14:22 INFO - '--extra-profile-file=tests/bin/plugins', 10:14:22 INFO - '--symbols-path=%(symbols_path)s', 10:14:22 INFO - '--log-raw=%(raw_log_file)s', 10:14:22 INFO - '--log-errorsummary=%(error_summary_file)s'), 10:14:22 INFO - 'run_filename': 'runreftest.py', 10:14:22 INFO - 'testsdir': 'reftest'}, 10:14:22 INFO - 'xpcshell': {'options': ('--symbols-path=%(symbols_path)s', 10:14:22 INFO - '--test-plugin-path=%(test_plugin_path)s', 10:14:22 INFO - '--log-raw=%(raw_log_file)s', 10:14:22 INFO - '--log-errorsummary=%(error_summary_file)s', 10:14:22 INFO - '--utility-path=tests/bin'), 10:14:22 INFO - 'run_filename': 'runxpcshelltests.py', 10:14:22 INFO - 'testsdir': 'xpcshell'}}, 10:14:22 INFO - 'tooltool_cache': '/builds/tooltool_cache', 10:14:22 INFO - 'vcs_output_timeout': 1000, 10:14:22 INFO - 'virtualenv_path': 'venv', 10:14:22 INFO - 'volatile_config': {'actions': None, 'add_actions': None, 'no_actions': None}, 10:14:22 INFO - 'work_dir': 'build', 10:14:22 INFO - 'xpcshell_name': 'xpcshell'} 10:14:22 INFO - ##### 10:14:22 INFO - ##### Running clobber step. 10:14:22 INFO - ##### 10:14:22 INFO - Running pre-action listener: _resource_record_pre_action 10:14:22 INFO - Running main action method: clobber 10:14:22 INFO - rmtree: /builds/slave/test/build 10:14:22 INFO - retry: Calling rmtree with args: ('/builds/slave/test/build',), kwargs: {}, attempt #1 10:14:25 INFO - Running post-action listener: _resource_record_post_action 10:14:25 INFO - ##### 10:14:25 INFO - ##### Finished clobber step (success) 10:14:25 INFO - ##### 10:14:25 INFO - ##### 10:14:25 INFO - ##### Running read-buildbot-config step. 10:14:25 INFO - ##### 10:14:25 INFO - Running pre-action listener: _resource_record_pre_action 10:14:25 INFO - Running main action method: read_buildbot_config 10:14:25 INFO - Using buildbot properties: 10:14:25 INFO - { 10:14:25 INFO - "project": "", 10:14:25 INFO - "product": "firefox", 10:14:25 INFO - "script_repo_revision": "production", 10:14:25 INFO - "scheduler": "tests-fx-team-ubuntu64-asan_vm-opt-unittest", 10:14:25 INFO - "repository": "", 10:14:25 INFO - "buildername": "Ubuntu ASAN VM 12.04 x64 fx-team opt test mochitest-clipboard", 10:14:25 INFO - "buildid": "20160525091547", 10:14:25 INFO - "pgo_build": "False", 10:14:25 INFO - "basedir": "/builds/slave/test", 10:14:25 INFO - "buildnumber": 1, 10:14:25 INFO - "slavename": "tst-linux64-spot-1649", 10:14:25 INFO - "master": "http://buildbot-master130.bb.releng.use1.mozilla.com:8201/", 10:14:25 INFO - "platform": "linux64-asan", 10:14:25 INFO - "branch": "fx-team", 10:14:25 INFO - "revision": "5444f0c1e3301076fa86e566eec58d89f5329aec", 10:14:25 INFO - "repo_path": "integration/fx-team", 10:14:25 INFO - "moz_repo_path": "", 10:14:25 INFO - "stage_platform": "linux64-asan", 10:14:25 INFO - "builduid": "c0ae127e15874a72a6a80a0473400de8", 10:14:25 INFO - "slavebuilddir": "test" 10:14:25 INFO - } 10:14:25 INFO - Found installer url https://queue.taskcluster.net/v1/task/fO5lMFwzS6GfRd-U77rLDg/artifacts/public/build/firefox-49.0a1.en-US.linux-x86_64-asan.tar.bz2. 10:14:25 INFO - Found a test packages url https://queue.taskcluster.net/v1/task/fO5lMFwzS6GfRd-U77rLDg/artifacts/public/build/firefox-49.0a1.en-US.linux-x86_64-asan.test_packages.json. 10:14:25 INFO - Running post-action listener: _resource_record_post_action 10:14:25 INFO - ##### 10:14:25 INFO - ##### Finished read-buildbot-config step (success) 10:14:25 INFO - ##### 10:14:25 INFO - ##### 10:14:25 INFO - ##### Running download-and-extract step. 10:14:25 INFO - ##### 10:14:25 INFO - Running pre-action listener: _resource_record_pre_action 10:14:25 INFO - Running main action method: download_and_extract 10:14:25 INFO - mkdir: /builds/slave/test/build/tests 10:14:25 INFO - proxxy config: {'regions': ['.use1.', '.usw2.', '.scl3'], 'instances': ['proxxy1.srv.releng.use1.mozilla.com', 'proxxy1.srv.releng.usw2.mozilla.com', 'proxxy1.srv.releng.scl3.mozilla.com'], 'urls': [('http://ftp.mozilla.org', 'ftp.mozilla.org'), ('https://ftp.mozilla.org', 'ftp.mozilla.org'), ('https://ftp-ssl.mozilla.org', 'ftp.mozilla.org'), ('http://pvtbuilds.pvt.build.mozilla.org', 'pvtbuilds.mozilla.org'), ('http://pypi.pvt.build.mozilla.org', 'pypi.pvt.build.mozilla.org'), ('http://pypi.pub.build.mozilla.org', 'pypi.pub.build.mozilla.org'), ('https://queue.taskcluster.net', 'queue.taskcluster.net')]} 10:14:25 INFO - https://queue.taskcluster.net/v1/task/fO5lMFwzS6GfRd-U77rLDg/artifacts/public/build/firefox-49.0a1.en-US.linux-x86_64-asan.test_packages.json matches https://queue.taskcluster.net 10:14:25 INFO - URL Candidate: http://queue.taskcluster.net.proxxy1.srv.releng.use1.mozilla.com/v1/task/fO5lMFwzS6GfRd-U77rLDg/artifacts/public/build/firefox-49.0a1.en-US.linux-x86_64-asan.test_packages.json 10:14:25 INFO - trying http://queue.taskcluster.net.proxxy1.srv.releng.use1.mozilla.com/v1/task/fO5lMFwzS6GfRd-U77rLDg/artifacts/public/build/firefox-49.0a1.en-US.linux-x86_64-asan.test_packages.json 10:14:25 INFO - Downloading http://queue.taskcluster.net.proxxy1.srv.releng.use1.mozilla.com/v1/task/fO5lMFwzS6GfRd-U77rLDg/artifacts/public/build/firefox-49.0a1.en-US.linux-x86_64-asan.test_packages.json to /builds/slave/test/build/firefox-49.0a1.en-US.linux-x86_64-asan.test_packages.json 10:14:25 INFO - retry: Calling _download_file with args: (), kwargs: {'url': 'http://queue.taskcluster.net.proxxy1.srv.releng.use1.mozilla.com/v1/task/fO5lMFwzS6GfRd-U77rLDg/artifacts/public/build/firefox-49.0a1.en-US.linux-x86_64-asan.test_packages.json', 'file_name': '/builds/slave/test/build/firefox-49.0a1.en-US.linux-x86_64-asan.test_packages.json'}, attempt #1 10:14:27 INFO - Downloaded 1451 bytes. 10:14:27 INFO - Reading from file /builds/slave/test/build/firefox-49.0a1.en-US.linux-x86_64-asan.test_packages.json 10:14:27 INFO - Using the following test package requirements: 10:14:27 INFO - {u'common': [u'firefox-49.0a1.en-US.linux-x86_64-asan.common.tests.zip'], 10:14:27 INFO - u'cppunittest': [u'firefox-49.0a1.en-US.linux-x86_64-asan.common.tests.zip', 10:14:27 INFO - u'firefox-49.0a1.en-US.linux-x86_64-asan.cppunittest.tests.zip'], 10:14:27 INFO - u'gtest': [u'firefox-49.0a1.en-US.linux-x86_64-asan.common.tests.zip', 10:14:27 INFO - u'firefox-49.0a1.en-US.linux-x86_64-asan.gtest.tests.zip'], 10:14:27 INFO - u'jittest': [u'firefox-49.0a1.en-US.linux-x86_64-asan.common.tests.zip', 10:14:27 INFO - u'jsshell-linux-x86_64-asan.zip'], 10:14:27 INFO - u'mochitest': [u'firefox-49.0a1.en-US.linux-x86_64-asan.common.tests.zip', 10:14:27 INFO - u'firefox-49.0a1.en-US.linux-x86_64-asan.mochitest.tests.zip'], 10:14:27 INFO - u'mozbase': [u'firefox-49.0a1.en-US.linux-x86_64-asan.common.tests.zip'], 10:14:27 INFO - u'reftest': [u'firefox-49.0a1.en-US.linux-x86_64-asan.common.tests.zip', 10:14:27 INFO - u'firefox-49.0a1.en-US.linux-x86_64-asan.reftest.tests.zip'], 10:14:27 INFO - u'talos': [u'firefox-49.0a1.en-US.linux-x86_64-asan.common.tests.zip', 10:14:27 INFO - u'firefox-49.0a1.en-US.linux-x86_64-asan.talos.tests.zip'], 10:14:27 INFO - u'web-platform': [u'firefox-49.0a1.en-US.linux-x86_64-asan.common.tests.zip', 10:14:27 INFO - u'firefox-49.0a1.en-US.linux-x86_64-asan.web-platform.tests.zip'], 10:14:27 INFO - u'xpcshell': [u'firefox-49.0a1.en-US.linux-x86_64-asan.common.tests.zip', 10:14:27 INFO - u'firefox-49.0a1.en-US.linux-x86_64-asan.xpcshell.tests.zip']} 10:14:27 INFO - Downloading packages: [u'firefox-49.0a1.en-US.linux-x86_64-asan.common.tests.zip', u'firefox-49.0a1.en-US.linux-x86_64-asan.mochitest.tests.zip'] for test suite category: mochitest 10:14:27 INFO - proxxy config: {'regions': ['.use1.', '.usw2.', '.scl3'], 'instances': ['proxxy1.srv.releng.use1.mozilla.com', 'proxxy1.srv.releng.usw2.mozilla.com', 'proxxy1.srv.releng.scl3.mozilla.com'], 'urls': [('http://ftp.mozilla.org', 'ftp.mozilla.org'), ('https://ftp.mozilla.org', 'ftp.mozilla.org'), ('https://ftp-ssl.mozilla.org', 'ftp.mozilla.org'), ('http://pvtbuilds.pvt.build.mozilla.org', 'pvtbuilds.mozilla.org'), ('http://pypi.pvt.build.mozilla.org', 'pypi.pvt.build.mozilla.org'), ('http://pypi.pub.build.mozilla.org', 'pypi.pub.build.mozilla.org'), ('https://queue.taskcluster.net', 'queue.taskcluster.net')]} 10:14:27 INFO - https://queue.taskcluster.net/v1/task/fO5lMFwzS6GfRd-U77rLDg/artifacts/public/build/firefox-49.0a1.en-US.linux-x86_64-asan.common.tests.zip matches https://queue.taskcluster.net 10:14:27 INFO - URL Candidate: http://queue.taskcluster.net.proxxy1.srv.releng.use1.mozilla.com/v1/task/fO5lMFwzS6GfRd-U77rLDg/artifacts/public/build/firefox-49.0a1.en-US.linux-x86_64-asan.common.tests.zip 10:14:27 INFO - trying http://queue.taskcluster.net.proxxy1.srv.releng.use1.mozilla.com/v1/task/fO5lMFwzS6GfRd-U77rLDg/artifacts/public/build/firefox-49.0a1.en-US.linux-x86_64-asan.common.tests.zip 10:14:27 INFO - Downloading http://queue.taskcluster.net.proxxy1.srv.releng.use1.mozilla.com/v1/task/fO5lMFwzS6GfRd-U77rLDg/artifacts/public/build/firefox-49.0a1.en-US.linux-x86_64-asan.common.tests.zip to /builds/slave/test/build/firefox-49.0a1.en-US.linux-x86_64-asan.common.tests.zip 10:14:27 INFO - retry: Calling _download_file with args: (), kwargs: {'url': u'http://queue.taskcluster.net.proxxy1.srv.releng.use1.mozilla.com/v1/task/fO5lMFwzS6GfRd-U77rLDg/artifacts/public/build/firefox-49.0a1.en-US.linux-x86_64-asan.common.tests.zip', 'file_name': u'/builds/slave/test/build/firefox-49.0a1.en-US.linux-x86_64-asan.common.tests.zip'}, attempt #1 10:14:30 INFO - Downloaded 24015847 bytes. 10:14:30 INFO - Running command: ['unzip', '-q', '-o', u'/builds/slave/test/build/firefox-49.0a1.en-US.linux-x86_64-asan.common.tests.zip', '-d', '/builds/slave/test/build/tests', 'bin/*', 'certs/*', 'config/*', 'marionette/*', 'modules/*', 'mozbase/*', 'tools/*', 'mochitest/*'] 10:14:30 INFO - Copy/paste: unzip -q -o /builds/slave/test/build/firefox-49.0a1.en-US.linux-x86_64-asan.common.tests.zip -d /builds/slave/test/build/tests bin/* certs/* config/* marionette/* modules/* mozbase/* tools/* mochitest/* 10:14:31 INFO - caution: filename not matched: mochitest/* 10:14:31 INFO - Return code: 11 10:14:31 INFO - proxxy config: {'regions': ['.use1.', '.usw2.', '.scl3'], 'instances': ['proxxy1.srv.releng.use1.mozilla.com', 'proxxy1.srv.releng.usw2.mozilla.com', 'proxxy1.srv.releng.scl3.mozilla.com'], 'urls': [('http://ftp.mozilla.org', 'ftp.mozilla.org'), ('https://ftp.mozilla.org', 'ftp.mozilla.org'), ('https://ftp-ssl.mozilla.org', 'ftp.mozilla.org'), ('http://pvtbuilds.pvt.build.mozilla.org', 'pvtbuilds.mozilla.org'), ('http://pypi.pvt.build.mozilla.org', 'pypi.pvt.build.mozilla.org'), ('http://pypi.pub.build.mozilla.org', 'pypi.pub.build.mozilla.org'), ('https://queue.taskcluster.net', 'queue.taskcluster.net')]} 10:14:31 INFO - https://queue.taskcluster.net/v1/task/fO5lMFwzS6GfRd-U77rLDg/artifacts/public/build/firefox-49.0a1.en-US.linux-x86_64-asan.mochitest.tests.zip matches https://queue.taskcluster.net 10:14:31 INFO - URL Candidate: http://queue.taskcluster.net.proxxy1.srv.releng.use1.mozilla.com/v1/task/fO5lMFwzS6GfRd-U77rLDg/artifacts/public/build/firefox-49.0a1.en-US.linux-x86_64-asan.mochitest.tests.zip 10:14:31 INFO - trying http://queue.taskcluster.net.proxxy1.srv.releng.use1.mozilla.com/v1/task/fO5lMFwzS6GfRd-U77rLDg/artifacts/public/build/firefox-49.0a1.en-US.linux-x86_64-asan.mochitest.tests.zip 10:14:31 INFO - Downloading http://queue.taskcluster.net.proxxy1.srv.releng.use1.mozilla.com/v1/task/fO5lMFwzS6GfRd-U77rLDg/artifacts/public/build/firefox-49.0a1.en-US.linux-x86_64-asan.mochitest.tests.zip to /builds/slave/test/build/firefox-49.0a1.en-US.linux-x86_64-asan.mochitest.tests.zip 10:14:31 INFO - retry: Calling _download_file with args: (), kwargs: {'url': u'http://queue.taskcluster.net.proxxy1.srv.releng.use1.mozilla.com/v1/task/fO5lMFwzS6GfRd-U77rLDg/artifacts/public/build/firefox-49.0a1.en-US.linux-x86_64-asan.mochitest.tests.zip', 'file_name': u'/builds/slave/test/build/firefox-49.0a1.en-US.linux-x86_64-asan.mochitest.tests.zip'}, attempt #1 10:14:38 INFO - Downloaded 65847687 bytes. 10:14:38 INFO - Running command: ['unzip', '-q', '-o', u'/builds/slave/test/build/firefox-49.0a1.en-US.linux-x86_64-asan.mochitest.tests.zip', '-d', '/builds/slave/test/build/tests', 'bin/*', 'certs/*', 'config/*', 'marionette/*', 'modules/*', 'mozbase/*', 'tools/*', 'mochitest/*'] 10:14:38 INFO - Copy/paste: unzip -q -o /builds/slave/test/build/firefox-49.0a1.en-US.linux-x86_64-asan.mochitest.tests.zip -d /builds/slave/test/build/tests bin/* certs/* config/* marionette/* modules/* mozbase/* tools/* mochitest/* 10:14:42 INFO - caution: filename not matched: bin/* 10:14:42 INFO - caution: filename not matched: certs/* 10:14:42 INFO - caution: filename not matched: config/* 10:14:42 INFO - caution: filename not matched: marionette/* 10:14:42 INFO - caution: filename not matched: modules/* 10:14:42 INFO - caution: filename not matched: mozbase/* 10:14:42 INFO - caution: filename not matched: tools/* 10:14:42 INFO - Return code: 11 10:14:42 INFO - proxxy config: {'regions': ['.use1.', '.usw2.', '.scl3'], 'instances': ['proxxy1.srv.releng.use1.mozilla.com', 'proxxy1.srv.releng.usw2.mozilla.com', 'proxxy1.srv.releng.scl3.mozilla.com'], 'urls': [('http://ftp.mozilla.org', 'ftp.mozilla.org'), ('https://ftp.mozilla.org', 'ftp.mozilla.org'), ('https://ftp-ssl.mozilla.org', 'ftp.mozilla.org'), ('http://pvtbuilds.pvt.build.mozilla.org', 'pvtbuilds.mozilla.org'), ('http://pypi.pvt.build.mozilla.org', 'pypi.pvt.build.mozilla.org'), ('http://pypi.pub.build.mozilla.org', 'pypi.pub.build.mozilla.org'), ('https://queue.taskcluster.net', 'queue.taskcluster.net')]} 10:14:42 INFO - https://queue.taskcluster.net/v1/task/fO5lMFwzS6GfRd-U77rLDg/artifacts/public/build/firefox-49.0a1.en-US.linux-x86_64-asan.tar.bz2 matches https://queue.taskcluster.net 10:14:42 INFO - URL Candidate: http://queue.taskcluster.net.proxxy1.srv.releng.use1.mozilla.com/v1/task/fO5lMFwzS6GfRd-U77rLDg/artifacts/public/build/firefox-49.0a1.en-US.linux-x86_64-asan.tar.bz2 10:14:42 INFO - trying http://queue.taskcluster.net.proxxy1.srv.releng.use1.mozilla.com/v1/task/fO5lMFwzS6GfRd-U77rLDg/artifacts/public/build/firefox-49.0a1.en-US.linux-x86_64-asan.tar.bz2 10:14:42 INFO - Downloading http://queue.taskcluster.net.proxxy1.srv.releng.use1.mozilla.com/v1/task/fO5lMFwzS6GfRd-U77rLDg/artifacts/public/build/firefox-49.0a1.en-US.linux-x86_64-asan.tar.bz2 to /builds/slave/test/build/installer.tar.bz2 10:14:42 INFO - retry: Calling _download_file with args: (), kwargs: {'url': 'http://queue.taskcluster.net.proxxy1.srv.releng.use1.mozilla.com/v1/task/fO5lMFwzS6GfRd-U77rLDg/artifacts/public/build/firefox-49.0a1.en-US.linux-x86_64-asan.tar.bz2', 'file_name': '/builds/slave/test/build/installer.tar.bz2'}, attempt #1 10:14:53 INFO - Downloaded 186090297 bytes. 10:14:53 INFO - Setting buildbot property build_url to https://queue.taskcluster.net/v1/task/fO5lMFwzS6GfRd-U77rLDg/artifacts/public/build/firefox-49.0a1.en-US.linux-x86_64-asan.tar.bz2 10:14:53 INFO - mkdir: /builds/slave/test/properties 10:14:53 INFO - Writing buildbot properties ['build_url'] to /builds/slave/test/properties/build_url 10:14:53 INFO - Writing to file /builds/slave/test/properties/build_url 10:14:53 INFO - Contents: 10:14:53 INFO - build_url:https://queue.taskcluster.net/v1/task/fO5lMFwzS6GfRd-U77rLDg/artifacts/public/build/firefox-49.0a1.en-US.linux-x86_64-asan.tar.bz2 10:14:54 WARNING - Can't figure out symbols_url from installer_url: https://queue.taskcluster.net/v1/task/fO5lMFwzS6GfRd-U77rLDg/artifacts/public/build/firefox-49.0a1.en-US.linux-x86_64-asan.tar.bz2! 10:14:54 WARNING - Traceback (most recent call last): 10:14:54 WARNING - 10:14:54 WARNING - File "/builds/slave/test/scripts/mozharness/mozilla/testing/testbase.py", line 200, in query_symbols_url 10:14:54 WARNING - self._urlopen(symbols_url, timeout=120) 10:14:54 WARNING - 10:14:54 WARNING - File "/builds/slave/test/scripts/mozharness/mozilla/testing/testbase.py", line 292, in _urlopen 10:14:54 WARNING - return urllib2.urlopen(url, **kwargs) 10:14:54 WARNING - 10:14:54 WARNING - File "/usr/lib/python2.7/urllib2.py", line 126, in urlopen 10:14:54 WARNING - return _opener.open(url, data, timeout) 10:14:54 WARNING - 10:14:54 WARNING - File "/usr/lib/python2.7/urllib2.py", line 406, in open 10:14:54 WARNING - response = meth(req, response) 10:14:54 WARNING - 10:14:54 WARNING - File "/usr/lib/python2.7/urllib2.py", line 519, in http_response 10:14:54 WARNING - 'http', request, response, code, msg, hdrs) 10:14:54 WARNING - 10:14:54 WARNING - File "/usr/lib/python2.7/urllib2.py", line 444, in error 10:14:54 WARNING - return self._call_chain(*args) 10:14:54 WARNING - 10:14:54 WARNING - File "/usr/lib/python2.7/urllib2.py", line 378, in _call_chain 10:14:54 WARNING - result = func(*args) 10:14:54 WARNING - 10:14:54 WARNING - File "/usr/lib/python2.7/urllib2.py", line 527, in http_error_default 10:14:54 WARNING - raise HTTPError(req.get_full_url(), code, msg, hdrs, fp) 10:14:54 WARNING - 10:14:54 WARNING - HTTPError: HTTP Error 404: Not Found 10:14:54 WARNING - 10:14:54 WARNING - No symbols_url found. Let minidump_stackwalk query for symbols. 10:14:54 INFO - Running post-action listener: _resource_record_post_action 10:14:54 INFO - Running post-action listener: set_extra_try_arguments 10:14:54 INFO - ##### 10:14:54 INFO - ##### Finished download-and-extract step (success) 10:14:54 INFO - ##### 10:14:54 INFO - ##### 10:14:54 INFO - ##### Running create-virtualenv step. 10:14:54 INFO - ##### 10:14:54 INFO - Running pre-action listener: _install_mozbase 10:14:54 INFO - Running pre-action listener: _pre_create_virtualenv 10:14:54 INFO - Running pre-action listener: _resource_record_pre_action 10:14:54 INFO - Running main action method: create_virtualenv 10:14:54 INFO - Creating virtualenv /builds/slave/test/build/venv 10:14:54 INFO - Running command: ['/tools/buildbot/bin/python', '/tools/misc-python/virtualenv.py', '--no-site-packages', '--distribute', '/builds/slave/test/build/venv'] in /builds/slave/test/build 10:14:54 INFO - Copy/paste: /tools/buildbot/bin/python /tools/misc-python/virtualenv.py --no-site-packages --distribute /builds/slave/test/build/venv 10:14:54 INFO - The --no-site-packages flag is deprecated; it is now the default behavior. 10:14:54 INFO - Using real prefix '/usr' 10:14:54 INFO - New python executable in /builds/slave/test/build/venv/bin/python 10:14:55 INFO - Installing distribute.............................................................................................................................................................................................done. 10:14:59 INFO - Installing pip.................done. 10:14:59 INFO - Return code: 0 10:14:59 INFO - Installing psutil>=3.1.1 into virtualenv /builds/slave/test/build/venv 10:14:59 INFO - proxxy config: {'regions': ['.use1.', '.usw2.', '.scl3'], 'instances': ['proxxy1.srv.releng.use1.mozilla.com', 'proxxy1.srv.releng.usw2.mozilla.com', 'proxxy1.srv.releng.scl3.mozilla.com'], 'urls': [('http://ftp.mozilla.org', 'ftp.mozilla.org'), ('https://ftp.mozilla.org', 'ftp.mozilla.org'), ('https://ftp-ssl.mozilla.org', 'ftp.mozilla.org'), ('http://pvtbuilds.pvt.build.mozilla.org', 'pvtbuilds.mozilla.org'), ('http://pypi.pvt.build.mozilla.org', 'pypi.pvt.build.mozilla.org'), ('http://pypi.pub.build.mozilla.org', 'pypi.pub.build.mozilla.org'), ('https://queue.taskcluster.net', 'queue.taskcluster.net')]} 10:14:59 INFO - http://pypi.pvt.build.mozilla.org/pub matches http://pypi.pvt.build.mozilla.org 10:14:59 INFO - URL Candidate: http://pypi.pvt.build.mozilla.org.proxxy1.srv.releng.use1.mozilla.com/pub 10:14:59 INFO - proxxy config: {'regions': ['.use1.', '.usw2.', '.scl3'], 'instances': ['proxxy1.srv.releng.use1.mozilla.com', 'proxxy1.srv.releng.usw2.mozilla.com', 'proxxy1.srv.releng.scl3.mozilla.com'], 'urls': [('http://ftp.mozilla.org', 'ftp.mozilla.org'), ('https://ftp.mozilla.org', 'ftp.mozilla.org'), ('https://ftp-ssl.mozilla.org', 'ftp.mozilla.org'), ('http://pvtbuilds.pvt.build.mozilla.org', 'pvtbuilds.mozilla.org'), ('http://pypi.pvt.build.mozilla.org', 'pypi.pvt.build.mozilla.org'), ('http://pypi.pub.build.mozilla.org', 'pypi.pub.build.mozilla.org'), ('https://queue.taskcluster.net', 'queue.taskcluster.net')]} 10:14:59 INFO - http://pypi.pub.build.mozilla.org/pub matches http://pypi.pub.build.mozilla.org 10:14:59 INFO - URL Candidate: http://pypi.pub.build.mozilla.org.proxxy1.srv.releng.use1.mozilla.com/pub 10:14:59 INFO - retry: Calling run_command with args: [['/builds/slave/test/build/venv/bin/pip', 'install', '--timeout', '120', '--no-index', '--find-links', 'http://pypi.pvt.build.mozilla.org.proxxy1.srv.releng.use1.mozilla.com/pub', '--find-links', 'http://pypi.pub.build.mozilla.org.proxxy1.srv.releng.use1.mozilla.com/pub', '--find-links', 'http://pypi.pvt.build.mozilla.org/pub', '--find-links', 'http://pypi.pub.build.mozilla.org/pub', 'psutil>=3.1.1']], kwargs: {'error_level': 'warning', 'error_list': [{'substr': 'not found or a compiler error:', 'level': 'warning'}, {'regex': <_sre.SRE_Pattern object at 0xbaa1f0>, 'level': 'error'}, {'regex': <_sre.SRE_Pattern object at 0x7fd9095bee40>, 'level': 'warning'}, {'regex': <_sre.SRE_Pattern object at 0xcaff50>, 'level': 'debug'}, {'substr': 'command not found', 'level': 'error'}, {'regex': <_sre.SRE_Pattern object at 0xcac600>, 'level': 'warning'}, {'substr': 'Traceback (most recent call last)', 'level': 'error'}, {'substr': 'SyntaxError: ', 'level': 'error'}, {'substr': 'TypeError: ', 'level': 'error'}, {'substr': 'NameError: ', 'level': 'error'}, {'substr': 'ZeroDivisionError: ', 'level': 'error'}, {'regex': <_sre.SRE_Pattern object at 0xcadf60>, 'level': 'critical'}, {'regex': <_sre.SRE_Pattern object at 0xcae1e0>, 'level': 'critical'}], 'cwd': '/builds/slave/test/build', 'env': {'LANG': 'en_US.UTF-8', 'TERM': 'linux', 'SHELL': '/bin/bash', 'XDG_SESSION_COOKIE': '9ca12473fbb1d023794ffd180000023c-1464192605.912671-1195279248', 'MAIL': '/var/mail/cltbld', 'SHLVL': '1', 'TMOUT': '86400', 'NODE_PATH': '/usr/lib/nodejs:/usr/lib/node_modules:/usr/share/javascript', 'PWD': '/builds/slave/test', 'LOGNAME': 'cltbld', 'USER': 'cltbld', 'PROPERTIES_FILE': '/builds/slave/test/buildprops.json', 'PATH': '/usr/local/bin:/usr/local/bin:/usr/bin:/bin:/usr/local/games:/usr/games', 'HOME': '/home/cltbld', 'DISPLAY': ':0', '_': '/tools/buildbot/bin/python'}}, attempt #1 10:14:59 INFO - Running command: ['/builds/slave/test/build/venv/bin/pip', 'install', '--timeout', '120', '--no-index', '--find-links', 'http://pypi.pvt.build.mozilla.org.proxxy1.srv.releng.use1.mozilla.com/pub', '--find-links', 'http://pypi.pub.build.mozilla.org.proxxy1.srv.releng.use1.mozilla.com/pub', '--find-links', 'http://pypi.pvt.build.mozilla.org/pub', '--find-links', 'http://pypi.pub.build.mozilla.org/pub', 'psutil>=3.1.1'] in /builds/slave/test/build 10:14:59 INFO - Copy/paste: /builds/slave/test/build/venv/bin/pip install --timeout 120 --no-index --find-links http://pypi.pvt.build.mozilla.org.proxxy1.srv.releng.use1.mozilla.com/pub --find-links http://pypi.pub.build.mozilla.org.proxxy1.srv.releng.use1.mozilla.com/pub --find-links http://pypi.pvt.build.mozilla.org/pub --find-links http://pypi.pub.build.mozilla.org/pub psutil>=3.1.1 10:14:59 INFO - Using env: {'DISPLAY': ':0', 10:14:59 INFO - 'HOME': '/home/cltbld', 10:14:59 INFO - 'LANG': 'en_US.UTF-8', 10:14:59 INFO - 'LOGNAME': 'cltbld', 10:14:59 INFO - 'MAIL': '/var/mail/cltbld', 10:14:59 INFO - 'NODE_PATH': '/usr/lib/nodejs:/usr/lib/node_modules:/usr/share/javascript', 10:14:59 INFO - 'PATH': '/usr/local/bin:/usr/local/bin:/usr/bin:/bin:/usr/local/games:/usr/games', 10:14:59 INFO - 'PROPERTIES_FILE': '/builds/slave/test/buildprops.json', 10:14:59 INFO - 'PWD': '/builds/slave/test', 10:14:59 INFO - 'SHELL': '/bin/bash', 10:14:59 INFO - 'SHLVL': '1', 10:14:59 INFO - 'TERM': 'linux', 10:14:59 INFO - 'TMOUT': '86400', 10:14:59 INFO - 'USER': 'cltbld', 10:14:59 INFO - 'XDG_SESSION_COOKIE': '9ca12473fbb1d023794ffd180000023c-1464192605.912671-1195279248', 10:14:59 INFO - '_': '/tools/buildbot/bin/python'} 10:14:59 INFO - Ignoring indexes: https://pypi.python.org/simple/ 10:14:59 INFO - Downloading/unpacking psutil>=3.1.1 10:14:59 INFO - http://pypi.pvt.build.mozilla.org/pub uses an insecure transport scheme (http). Consider using https if pypi.pvt.build.mozilla.org has it available 10:14:59 INFO - http://pypi.pub.build.mozilla.org/pub uses an insecure transport scheme (http). Consider using https if pypi.pub.build.mozilla.org has it available 10:14:59 INFO - http://pypi.pvt.build.mozilla.org.proxxy1.srv.releng.use1.mozilla.com/pub uses an insecure transport scheme (http). Consider using https if pypi.pvt.build.mozilla.org.proxxy1.srv.releng.use1.mozilla.com has it available 10:14:59 INFO - http://pypi.pub.build.mozilla.org.proxxy1.srv.releng.use1.mozilla.com/pub uses an insecure transport scheme (http). Consider using https if pypi.pub.build.mozilla.org.proxxy1.srv.releng.use1.mozilla.com has it available 10:14:59 INFO - http://pypi.pvt.build.mozilla.org/pub uses an insecure transport scheme (http). Consider using https if pypi.pvt.build.mozilla.org has it available 10:14:59 INFO - http://pypi.pub.build.mozilla.org/pub uses an insecure transport scheme (http). Consider using https if pypi.pub.build.mozilla.org has it available 10:15:05 INFO - Running setup.py (path:/builds/slave/test/build/venv/build/psutil/setup.py) egg_info for package psutil 10:15:05 INFO - warning: no previously-included files matching '*' found under directory 'docs/_build' 10:15:05 INFO - warning: manifest_maker: MANIFEST.in, line 18: 'recursive-include' expects ... 10:15:05 INFO - Installing collected packages: psutil 10:15:05 INFO - Running setup.py install for psutil 10:15:05 INFO - building 'psutil._psutil_linux' extension 10:15:05 INFO - gcc -pthread -fno-strict-aliasing -DNDEBUG -g -fwrapv -O2 -Wall -Wstrict-prototypes -fPIC -DPSUTIL_VERSION=311 -I/usr/include/python2.7 -c psutil/_psutil_linux.c -o build/temp.linux-x86_64-2.7/psutil/_psutil_linux.o 10:15:06 INFO - gcc -pthread -shared -Wl,-O1 -Wl,-Bsymbolic-functions -Wl,-Bsymbolic-functions -Wl,-z,relro build/temp.linux-x86_64-2.7/psutil/_psutil_linux.o -o build/lib.linux-x86_64-2.7/psutil/_psutil_linux.so 10:15:06 INFO - building 'psutil._psutil_posix' extension 10:15:06 INFO - gcc -pthread -fno-strict-aliasing -DNDEBUG -g -fwrapv -O2 -Wall -Wstrict-prototypes -fPIC -I/usr/include/python2.7 -c psutil/_psutil_posix.c -o build/temp.linux-x86_64-2.7/psutil/_psutil_posix.o 10:15:06 INFO - gcc -pthread -shared -Wl,-O1 -Wl,-Bsymbolic-functions -Wl,-Bsymbolic-functions -Wl,-z,relro build/temp.linux-x86_64-2.7/psutil/_psutil_posix.o -o build/lib.linux-x86_64-2.7/psutil/_psutil_posix.so 10:15:06 INFO - warning: no previously-included files matching '*' found under directory 'docs/_build' 10:15:06 INFO - warning: manifest_maker: MANIFEST.in, line 18: 'recursive-include' expects ... 10:15:06 INFO - Successfully installed psutil 10:15:06 INFO - Cleaning up... 10:15:07 INFO - Return code: 0 10:15:07 INFO - Installing mozsystemmonitor==0.3 into virtualenv /builds/slave/test/build/venv 10:15:07 INFO - proxxy config: {'regions': ['.use1.', '.usw2.', '.scl3'], 'instances': ['proxxy1.srv.releng.use1.mozilla.com', 'proxxy1.srv.releng.usw2.mozilla.com', 'proxxy1.srv.releng.scl3.mozilla.com'], 'urls': [('http://ftp.mozilla.org', 'ftp.mozilla.org'), ('https://ftp.mozilla.org', 'ftp.mozilla.org'), ('https://ftp-ssl.mozilla.org', 'ftp.mozilla.org'), ('http://pvtbuilds.pvt.build.mozilla.org', 'pvtbuilds.mozilla.org'), ('http://pypi.pvt.build.mozilla.org', 'pypi.pvt.build.mozilla.org'), ('http://pypi.pub.build.mozilla.org', 'pypi.pub.build.mozilla.org'), ('https://queue.taskcluster.net', 'queue.taskcluster.net')]} 10:15:07 INFO - http://pypi.pvt.build.mozilla.org/pub matches http://pypi.pvt.build.mozilla.org 10:15:07 INFO - URL Candidate: http://pypi.pvt.build.mozilla.org.proxxy1.srv.releng.use1.mozilla.com/pub 10:15:07 INFO - proxxy config: {'regions': ['.use1.', '.usw2.', '.scl3'], 'instances': ['proxxy1.srv.releng.use1.mozilla.com', 'proxxy1.srv.releng.usw2.mozilla.com', 'proxxy1.srv.releng.scl3.mozilla.com'], 'urls': [('http://ftp.mozilla.org', 'ftp.mozilla.org'), ('https://ftp.mozilla.org', 'ftp.mozilla.org'), ('https://ftp-ssl.mozilla.org', 'ftp.mozilla.org'), ('http://pvtbuilds.pvt.build.mozilla.org', 'pvtbuilds.mozilla.org'), ('http://pypi.pvt.build.mozilla.org', 'pypi.pvt.build.mozilla.org'), ('http://pypi.pub.build.mozilla.org', 'pypi.pub.build.mozilla.org'), ('https://queue.taskcluster.net', 'queue.taskcluster.net')]} 10:15:07 INFO - http://pypi.pub.build.mozilla.org/pub matches http://pypi.pub.build.mozilla.org 10:15:07 INFO - URL Candidate: http://pypi.pub.build.mozilla.org.proxxy1.srv.releng.use1.mozilla.com/pub 10:15:07 INFO - retry: Calling run_command with args: [['/builds/slave/test/build/venv/bin/pip', 'install', '--timeout', '120', '--no-index', '--find-links', 'http://pypi.pvt.build.mozilla.org.proxxy1.srv.releng.use1.mozilla.com/pub', '--find-links', 'http://pypi.pub.build.mozilla.org.proxxy1.srv.releng.use1.mozilla.com/pub', '--find-links', 'http://pypi.pvt.build.mozilla.org/pub', '--find-links', 'http://pypi.pub.build.mozilla.org/pub', 'mozsystemmonitor==0.3']], kwargs: {'error_level': 'warning', 'error_list': [{'substr': 'not found or a compiler error:', 'level': 'warning'}, {'regex': <_sre.SRE_Pattern object at 0xbaa1f0>, 'level': 'error'}, {'regex': <_sre.SRE_Pattern object at 0x7fd9095bee40>, 'level': 'warning'}, {'regex': <_sre.SRE_Pattern object at 0xcaff50>, 'level': 'debug'}, {'substr': 'command not found', 'level': 'error'}, {'regex': <_sre.SRE_Pattern object at 0xcac600>, 'level': 'warning'}, {'substr': 'Traceback (most recent call last)', 'level': 'error'}, {'substr': 'SyntaxError: ', 'level': 'error'}, {'substr': 'TypeError: ', 'level': 'error'}, {'substr': 'NameError: ', 'level': 'error'}, {'substr': 'ZeroDivisionError: ', 'level': 'error'}, {'regex': <_sre.SRE_Pattern object at 0xcadf60>, 'level': 'critical'}, {'regex': <_sre.SRE_Pattern object at 0xcae1e0>, 'level': 'critical'}], 'cwd': '/builds/slave/test/build', 'env': {'LANG': 'en_US.UTF-8', 'TERM': 'linux', 'SHELL': '/bin/bash', 'XDG_SESSION_COOKIE': '9ca12473fbb1d023794ffd180000023c-1464192605.912671-1195279248', 'MAIL': '/var/mail/cltbld', 'SHLVL': '1', 'TMOUT': '86400', 'NODE_PATH': '/usr/lib/nodejs:/usr/lib/node_modules:/usr/share/javascript', 'PWD': '/builds/slave/test', 'LOGNAME': 'cltbld', 'USER': 'cltbld', 'PROPERTIES_FILE': '/builds/slave/test/buildprops.json', 'PATH': '/usr/local/bin:/usr/local/bin:/usr/bin:/bin:/usr/local/games:/usr/games', 'HOME': '/home/cltbld', 'DISPLAY': ':0', '_': '/tools/buildbot/bin/python'}}, attempt #1 10:15:07 INFO - Running command: ['/builds/slave/test/build/venv/bin/pip', 'install', '--timeout', '120', '--no-index', '--find-links', 'http://pypi.pvt.build.mozilla.org.proxxy1.srv.releng.use1.mozilla.com/pub', '--find-links', 'http://pypi.pub.build.mozilla.org.proxxy1.srv.releng.use1.mozilla.com/pub', '--find-links', 'http://pypi.pvt.build.mozilla.org/pub', '--find-links', 'http://pypi.pub.build.mozilla.org/pub', 'mozsystemmonitor==0.3'] in /builds/slave/test/build 10:15:07 INFO - Copy/paste: /builds/slave/test/build/venv/bin/pip install --timeout 120 --no-index --find-links http://pypi.pvt.build.mozilla.org.proxxy1.srv.releng.use1.mozilla.com/pub --find-links http://pypi.pub.build.mozilla.org.proxxy1.srv.releng.use1.mozilla.com/pub --find-links http://pypi.pvt.build.mozilla.org/pub --find-links http://pypi.pub.build.mozilla.org/pub mozsystemmonitor==0.3 10:15:07 INFO - Using env: {'DISPLAY': ':0', 10:15:07 INFO - 'HOME': '/home/cltbld', 10:15:07 INFO - 'LANG': 'en_US.UTF-8', 10:15:07 INFO - 'LOGNAME': 'cltbld', 10:15:07 INFO - 'MAIL': '/var/mail/cltbld', 10:15:07 INFO - 'NODE_PATH': '/usr/lib/nodejs:/usr/lib/node_modules:/usr/share/javascript', 10:15:07 INFO - 'PATH': '/usr/local/bin:/usr/local/bin:/usr/bin:/bin:/usr/local/games:/usr/games', 10:15:07 INFO - 'PROPERTIES_FILE': '/builds/slave/test/buildprops.json', 10:15:07 INFO - 'PWD': '/builds/slave/test', 10:15:07 INFO - 'SHELL': '/bin/bash', 10:15:07 INFO - 'SHLVL': '1', 10:15:07 INFO - 'TERM': 'linux', 10:15:07 INFO - 'TMOUT': '86400', 10:15:07 INFO - 'USER': 'cltbld', 10:15:07 INFO - 'XDG_SESSION_COOKIE': '9ca12473fbb1d023794ffd180000023c-1464192605.912671-1195279248', 10:15:07 INFO - '_': '/tools/buildbot/bin/python'} 10:15:07 INFO - Ignoring indexes: https://pypi.python.org/simple/ 10:15:07 INFO - Downloading/unpacking mozsystemmonitor==0.3 10:15:07 INFO - http://pypi.pvt.build.mozilla.org/pub uses an insecure transport scheme (http). Consider using https if pypi.pvt.build.mozilla.org has it available 10:15:07 INFO - http://pypi.pub.build.mozilla.org/pub uses an insecure transport scheme (http). Consider using https if pypi.pub.build.mozilla.org has it available 10:15:07 INFO - http://pypi.pvt.build.mozilla.org.proxxy1.srv.releng.use1.mozilla.com/pub uses an insecure transport scheme (http). Consider using https if pypi.pvt.build.mozilla.org.proxxy1.srv.releng.use1.mozilla.com has it available 10:15:07 INFO - http://pypi.pub.build.mozilla.org.proxxy1.srv.releng.use1.mozilla.com/pub uses an insecure transport scheme (http). Consider using https if pypi.pub.build.mozilla.org.proxxy1.srv.releng.use1.mozilla.com has it available 10:15:07 INFO - http://pypi.pvt.build.mozilla.org/pub uses an insecure transport scheme (http). Consider using https if pypi.pvt.build.mozilla.org has it available 10:15:07 INFO - http://pypi.pub.build.mozilla.org/pub uses an insecure transport scheme (http). Consider using https if pypi.pub.build.mozilla.org has it available 10:15:12 INFO - Downloading mozsystemmonitor-0.3.tar.gz 10:15:12 INFO - Running setup.py (path:/builds/slave/test/build/venv/build/mozsystemmonitor/setup.py) egg_info for package mozsystemmonitor 10:15:12 INFO - Requirement already satisfied (use --upgrade to upgrade): psutil>=3.1.1 in ./venv/lib/python2.7/site-packages (from mozsystemmonitor==0.3) 10:15:12 INFO - Installing collected packages: mozsystemmonitor 10:15:12 INFO - Running setup.py install for mozsystemmonitor 10:15:12 INFO - Successfully installed mozsystemmonitor 10:15:12 INFO - Cleaning up... 10:15:13 INFO - Return code: 0 10:15:13 INFO - Installing blobuploader==1.2.4 into virtualenv /builds/slave/test/build/venv 10:15:13 INFO - proxxy config: {'regions': ['.use1.', '.usw2.', '.scl3'], 'instances': ['proxxy1.srv.releng.use1.mozilla.com', 'proxxy1.srv.releng.usw2.mozilla.com', 'proxxy1.srv.releng.scl3.mozilla.com'], 'urls': [('http://ftp.mozilla.org', 'ftp.mozilla.org'), ('https://ftp.mozilla.org', 'ftp.mozilla.org'), ('https://ftp-ssl.mozilla.org', 'ftp.mozilla.org'), ('http://pvtbuilds.pvt.build.mozilla.org', 'pvtbuilds.mozilla.org'), ('http://pypi.pvt.build.mozilla.org', 'pypi.pvt.build.mozilla.org'), ('http://pypi.pub.build.mozilla.org', 'pypi.pub.build.mozilla.org'), ('https://queue.taskcluster.net', 'queue.taskcluster.net')]} 10:15:13 INFO - http://pypi.pvt.build.mozilla.org/pub matches http://pypi.pvt.build.mozilla.org 10:15:13 INFO - URL Candidate: http://pypi.pvt.build.mozilla.org.proxxy1.srv.releng.use1.mozilla.com/pub 10:15:13 INFO - proxxy config: {'regions': ['.use1.', '.usw2.', '.scl3'], 'instances': ['proxxy1.srv.releng.use1.mozilla.com', 'proxxy1.srv.releng.usw2.mozilla.com', 'proxxy1.srv.releng.scl3.mozilla.com'], 'urls': [('http://ftp.mozilla.org', 'ftp.mozilla.org'), ('https://ftp.mozilla.org', 'ftp.mozilla.org'), ('https://ftp-ssl.mozilla.org', 'ftp.mozilla.org'), ('http://pvtbuilds.pvt.build.mozilla.org', 'pvtbuilds.mozilla.org'), ('http://pypi.pvt.build.mozilla.org', 'pypi.pvt.build.mozilla.org'), ('http://pypi.pub.build.mozilla.org', 'pypi.pub.build.mozilla.org'), ('https://queue.taskcluster.net', 'queue.taskcluster.net')]} 10:15:13 INFO - http://pypi.pub.build.mozilla.org/pub matches http://pypi.pub.build.mozilla.org 10:15:13 INFO - URL Candidate: http://pypi.pub.build.mozilla.org.proxxy1.srv.releng.use1.mozilla.com/pub 10:15:13 INFO - retry: Calling run_command with args: [['/builds/slave/test/build/venv/bin/pip', 'install', '--timeout', '120', '--no-index', '--find-links', 'http://pypi.pvt.build.mozilla.org.proxxy1.srv.releng.use1.mozilla.com/pub', '--find-links', 'http://pypi.pub.build.mozilla.org.proxxy1.srv.releng.use1.mozilla.com/pub', '--find-links', 'http://pypi.pvt.build.mozilla.org/pub', '--find-links', 'http://pypi.pub.build.mozilla.org/pub', 'blobuploader==1.2.4']], kwargs: {'error_level': 'warning', 'error_list': [{'substr': 'not found or a compiler error:', 'level': 'warning'}, {'regex': <_sre.SRE_Pattern object at 0xbaa1f0>, 'level': 'error'}, {'regex': <_sre.SRE_Pattern object at 0x7fd9095bee40>, 'level': 'warning'}, {'regex': <_sre.SRE_Pattern object at 0xcaff50>, 'level': 'debug'}, {'substr': 'command not found', 'level': 'error'}, {'regex': <_sre.SRE_Pattern object at 0xcac600>, 'level': 'warning'}, {'substr': 'Traceback (most recent call last)', 'level': 'error'}, {'substr': 'SyntaxError: ', 'level': 'error'}, {'substr': 'TypeError: ', 'level': 'error'}, {'substr': 'NameError: ', 'level': 'error'}, {'substr': 'ZeroDivisionError: ', 'level': 'error'}, {'regex': <_sre.SRE_Pattern object at 0xcadf60>, 'level': 'critical'}, {'regex': <_sre.SRE_Pattern object at 0xcae1e0>, 'level': 'critical'}], 'cwd': '/builds/slave/test/build', 'env': {'LANG': 'en_US.UTF-8', 'TERM': 'linux', 'SHELL': '/bin/bash', 'XDG_SESSION_COOKIE': '9ca12473fbb1d023794ffd180000023c-1464192605.912671-1195279248', 'MAIL': '/var/mail/cltbld', 'SHLVL': '1', 'TMOUT': '86400', 'NODE_PATH': '/usr/lib/nodejs:/usr/lib/node_modules:/usr/share/javascript', 'PWD': '/builds/slave/test', 'LOGNAME': 'cltbld', 'USER': 'cltbld', 'PROPERTIES_FILE': '/builds/slave/test/buildprops.json', 'PATH': '/usr/local/bin:/usr/local/bin:/usr/bin:/bin:/usr/local/games:/usr/games', 'HOME': '/home/cltbld', 'DISPLAY': ':0', '_': '/tools/buildbot/bin/python'}}, attempt #1 10:15:13 INFO - Running command: ['/builds/slave/test/build/venv/bin/pip', 'install', '--timeout', '120', '--no-index', '--find-links', 'http://pypi.pvt.build.mozilla.org.proxxy1.srv.releng.use1.mozilla.com/pub', '--find-links', 'http://pypi.pub.build.mozilla.org.proxxy1.srv.releng.use1.mozilla.com/pub', '--find-links', 'http://pypi.pvt.build.mozilla.org/pub', '--find-links', 'http://pypi.pub.build.mozilla.org/pub', 'blobuploader==1.2.4'] in /builds/slave/test/build 10:15:13 INFO - Copy/paste: /builds/slave/test/build/venv/bin/pip install --timeout 120 --no-index --find-links http://pypi.pvt.build.mozilla.org.proxxy1.srv.releng.use1.mozilla.com/pub --find-links http://pypi.pub.build.mozilla.org.proxxy1.srv.releng.use1.mozilla.com/pub --find-links http://pypi.pvt.build.mozilla.org/pub --find-links http://pypi.pub.build.mozilla.org/pub blobuploader==1.2.4 10:15:13 INFO - Using env: {'DISPLAY': ':0', 10:15:13 INFO - 'HOME': '/home/cltbld', 10:15:13 INFO - 'LANG': 'en_US.UTF-8', 10:15:13 INFO - 'LOGNAME': 'cltbld', 10:15:13 INFO - 'MAIL': '/var/mail/cltbld', 10:15:13 INFO - 'NODE_PATH': '/usr/lib/nodejs:/usr/lib/node_modules:/usr/share/javascript', 10:15:13 INFO - 'PATH': '/usr/local/bin:/usr/local/bin:/usr/bin:/bin:/usr/local/games:/usr/games', 10:15:13 INFO - 'PROPERTIES_FILE': '/builds/slave/test/buildprops.json', 10:15:13 INFO - 'PWD': '/builds/slave/test', 10:15:13 INFO - 'SHELL': '/bin/bash', 10:15:13 INFO - 'SHLVL': '1', 10:15:13 INFO - 'TERM': 'linux', 10:15:13 INFO - 'TMOUT': '86400', 10:15:13 INFO - 'USER': 'cltbld', 10:15:13 INFO - 'XDG_SESSION_COOKIE': '9ca12473fbb1d023794ffd180000023c-1464192605.912671-1195279248', 10:15:13 INFO - '_': '/tools/buildbot/bin/python'} 10:15:13 INFO - Ignoring indexes: https://pypi.python.org/simple/ 10:15:13 INFO - Downloading/unpacking blobuploader==1.2.4 10:15:13 INFO - http://pypi.pvt.build.mozilla.org/pub uses an insecure transport scheme (http). Consider using https if pypi.pvt.build.mozilla.org has it available 10:15:13 INFO - http://pypi.pub.build.mozilla.org/pub uses an insecure transport scheme (http). Consider using https if pypi.pub.build.mozilla.org has it available 10:15:13 INFO - http://pypi.pvt.build.mozilla.org.proxxy1.srv.releng.use1.mozilla.com/pub uses an insecure transport scheme (http). Consider using https if pypi.pvt.build.mozilla.org.proxxy1.srv.releng.use1.mozilla.com has it available 10:15:13 INFO - http://pypi.pub.build.mozilla.org.proxxy1.srv.releng.use1.mozilla.com/pub uses an insecure transport scheme (http). Consider using https if pypi.pub.build.mozilla.org.proxxy1.srv.releng.use1.mozilla.com has it available 10:15:13 INFO - http://pypi.pvt.build.mozilla.org/pub uses an insecure transport scheme (http). Consider using https if pypi.pvt.build.mozilla.org has it available 10:15:13 INFO - http://pypi.pub.build.mozilla.org/pub uses an insecure transport scheme (http). Consider using https if pypi.pub.build.mozilla.org has it available 10:15:18 INFO - Downloading blobuploader-1.2.4.tar.gz 10:15:18 INFO - Running setup.py (path:/builds/slave/test/build/venv/build/blobuploader/setup.py) egg_info for package blobuploader 10:15:18 INFO - Downloading/unpacking requests==1.2.3. (from blobuploader==1.2.4) 10:15:18 INFO - http://pypi.pvt.build.mozilla.org/pub uses an insecure transport scheme (http). Consider using https if pypi.pvt.build.mozilla.org has it available 10:15:18 INFO - http://pypi.pub.build.mozilla.org/pub uses an insecure transport scheme (http). Consider using https if pypi.pub.build.mozilla.org has it available 10:15:18 INFO - http://pypi.pvt.build.mozilla.org.proxxy1.srv.releng.use1.mozilla.com/pub uses an insecure transport scheme (http). Consider using https if pypi.pvt.build.mozilla.org.proxxy1.srv.releng.use1.mozilla.com has it available 10:15:18 INFO - http://pypi.pub.build.mozilla.org.proxxy1.srv.releng.use1.mozilla.com/pub uses an insecure transport scheme (http). Consider using https if pypi.pub.build.mozilla.org.proxxy1.srv.releng.use1.mozilla.com has it available 10:15:18 INFO - http://pypi.pvt.build.mozilla.org/pub uses an insecure transport scheme (http). Consider using https if pypi.pvt.build.mozilla.org has it available 10:15:18 INFO - http://pypi.pub.build.mozilla.org/pub uses an insecure transport scheme (http). Consider using https if pypi.pub.build.mozilla.org has it available 10:15:19 INFO - Running setup.py (path:/builds/slave/test/build/venv/build/requests/setup.py) egg_info for package requests 10:15:19 INFO - Downloading/unpacking docopt==0.6.1 (from blobuploader==1.2.4) 10:15:19 INFO - http://pypi.pvt.build.mozilla.org/pub uses an insecure transport scheme (http). Consider using https if pypi.pvt.build.mozilla.org has it available 10:15:19 INFO - http://pypi.pub.build.mozilla.org/pub uses an insecure transport scheme (http). Consider using https if pypi.pub.build.mozilla.org has it available 10:15:19 INFO - http://pypi.pvt.build.mozilla.org.proxxy1.srv.releng.use1.mozilla.com/pub uses an insecure transport scheme (http). Consider using https if pypi.pvt.build.mozilla.org.proxxy1.srv.releng.use1.mozilla.com has it available 10:15:19 INFO - http://pypi.pub.build.mozilla.org.proxxy1.srv.releng.use1.mozilla.com/pub uses an insecure transport scheme (http). Consider using https if pypi.pub.build.mozilla.org.proxxy1.srv.releng.use1.mozilla.com has it available 10:15:19 INFO - http://pypi.pvt.build.mozilla.org/pub uses an insecure transport scheme (http). Consider using https if pypi.pvt.build.mozilla.org has it available 10:15:19 INFO - http://pypi.pub.build.mozilla.org/pub uses an insecure transport scheme (http). Consider using https if pypi.pub.build.mozilla.org has it available 10:15:20 INFO - Downloading docopt-0.6.1.tar.gz 10:15:20 INFO - Running setup.py (path:/builds/slave/test/build/venv/build/docopt/setup.py) egg_info for package docopt 10:15:20 INFO - Installing collected packages: blobuploader, requests, docopt 10:15:20 INFO - Running setup.py install for blobuploader 10:15:20 INFO - changing mode of build/scripts-2.7/blobberc.py from 664 to 775 10:15:20 INFO - changing mode of /builds/slave/test/build/venv/bin/blobberc.py to 775 10:15:20 INFO - Running setup.py install for requests 10:15:21 INFO - Running setup.py install for docopt 10:15:21 INFO - Successfully installed blobuploader requests docopt 10:15:21 INFO - Cleaning up... 10:15:21 INFO - Return code: 0 10:15:21 INFO - Installing None into virtualenv /builds/slave/test/build/venv 10:15:21 INFO - proxxy config: {'regions': ['.use1.', '.usw2.', '.scl3'], 'instances': ['proxxy1.srv.releng.use1.mozilla.com', 'proxxy1.srv.releng.usw2.mozilla.com', 'proxxy1.srv.releng.scl3.mozilla.com'], 'urls': [('http://ftp.mozilla.org', 'ftp.mozilla.org'), ('https://ftp.mozilla.org', 'ftp.mozilla.org'), ('https://ftp-ssl.mozilla.org', 'ftp.mozilla.org'), ('http://pvtbuilds.pvt.build.mozilla.org', 'pvtbuilds.mozilla.org'), ('http://pypi.pvt.build.mozilla.org', 'pypi.pvt.build.mozilla.org'), ('http://pypi.pub.build.mozilla.org', 'pypi.pub.build.mozilla.org'), ('https://queue.taskcluster.net', 'queue.taskcluster.net')]} 10:15:21 INFO - http://pypi.pvt.build.mozilla.org/pub matches http://pypi.pvt.build.mozilla.org 10:15:21 INFO - URL Candidate: http://pypi.pvt.build.mozilla.org.proxxy1.srv.releng.use1.mozilla.com/pub 10:15:21 INFO - proxxy config: {'regions': ['.use1.', '.usw2.', '.scl3'], 'instances': ['proxxy1.srv.releng.use1.mozilla.com', 'proxxy1.srv.releng.usw2.mozilla.com', 'proxxy1.srv.releng.scl3.mozilla.com'], 'urls': [('http://ftp.mozilla.org', 'ftp.mozilla.org'), ('https://ftp.mozilla.org', 'ftp.mozilla.org'), ('https://ftp-ssl.mozilla.org', 'ftp.mozilla.org'), ('http://pvtbuilds.pvt.build.mozilla.org', 'pvtbuilds.mozilla.org'), ('http://pypi.pvt.build.mozilla.org', 'pypi.pvt.build.mozilla.org'), ('http://pypi.pub.build.mozilla.org', 'pypi.pub.build.mozilla.org'), ('https://queue.taskcluster.net', 'queue.taskcluster.net')]} 10:15:21 INFO - http://pypi.pub.build.mozilla.org/pub matches http://pypi.pub.build.mozilla.org 10:15:21 INFO - URL Candidate: http://pypi.pub.build.mozilla.org.proxxy1.srv.releng.use1.mozilla.com/pub 10:15:21 INFO - retry: Calling run_command with args: [['/builds/slave/test/build/venv/bin/pip', 'install', '--no-deps', '--timeout', '120', '-r', '/builds/slave/test/build/tests/config/mozbase_requirements.txt', '--no-index', '--find-links', 'http://pypi.pvt.build.mozilla.org.proxxy1.srv.releng.use1.mozilla.com/pub', '--find-links', 'http://pypi.pub.build.mozilla.org.proxxy1.srv.releng.use1.mozilla.com/pub', '--find-links', 'http://pypi.pvt.build.mozilla.org/pub', '--find-links', 'http://pypi.pub.build.mozilla.org/pub']], kwargs: {'error_level': 'warning', 'error_list': [{'substr': 'not found or a compiler error:', 'level': 'warning'}, {'regex': <_sre.SRE_Pattern object at 0xbaa1f0>, 'level': 'error'}, {'regex': <_sre.SRE_Pattern object at 0x7fd9095bee40>, 'level': 'warning'}, {'regex': <_sre.SRE_Pattern object at 0xcaff50>, 'level': 'debug'}, {'substr': 'command not found', 'level': 'error'}, {'regex': <_sre.SRE_Pattern object at 0xcac600>, 'level': 'warning'}, {'substr': 'Traceback (most recent call last)', 'level': 'error'}, {'substr': 'SyntaxError: ', 'level': 'error'}, {'substr': 'TypeError: ', 'level': 'error'}, {'substr': 'NameError: ', 'level': 'error'}, {'substr': 'ZeroDivisionError: ', 'level': 'error'}, {'regex': <_sre.SRE_Pattern object at 0xcadf60>, 'level': 'critical'}, {'regex': <_sre.SRE_Pattern object at 0xcae1e0>, 'level': 'critical'}], 'cwd': '/builds/slave/test/build/tests/config', 'env': {'LANG': 'en_US.UTF-8', 'TERM': 'linux', 'SHELL': '/bin/bash', 'XDG_SESSION_COOKIE': '9ca12473fbb1d023794ffd180000023c-1464192605.912671-1195279248', 'MAIL': '/var/mail/cltbld', 'SHLVL': '1', 'TMOUT': '86400', 'NODE_PATH': '/usr/lib/nodejs:/usr/lib/node_modules:/usr/share/javascript', 'PWD': '/builds/slave/test', 'LOGNAME': 'cltbld', 'USER': 'cltbld', 'PROPERTIES_FILE': '/builds/slave/test/buildprops.json', 'PATH': '/usr/local/bin:/usr/local/bin:/usr/bin:/bin:/usr/local/games:/usr/games', 'HOME': '/home/cltbld', 'DISPLAY': ':0', '_': '/tools/buildbot/bin/python'}}, attempt #1 10:15:21 INFO - Running command: ['/builds/slave/test/build/venv/bin/pip', 'install', '--no-deps', '--timeout', '120', '-r', '/builds/slave/test/build/tests/config/mozbase_requirements.txt', '--no-index', '--find-links', 'http://pypi.pvt.build.mozilla.org.proxxy1.srv.releng.use1.mozilla.com/pub', '--find-links', 'http://pypi.pub.build.mozilla.org.proxxy1.srv.releng.use1.mozilla.com/pub', '--find-links', 'http://pypi.pvt.build.mozilla.org/pub', '--find-links', 'http://pypi.pub.build.mozilla.org/pub'] in /builds/slave/test/build/tests/config 10:15:21 INFO - Copy/paste: /builds/slave/test/build/venv/bin/pip install --no-deps --timeout 120 -r /builds/slave/test/build/tests/config/mozbase_requirements.txt --no-index --find-links http://pypi.pvt.build.mozilla.org.proxxy1.srv.releng.use1.mozilla.com/pub --find-links http://pypi.pub.build.mozilla.org.proxxy1.srv.releng.use1.mozilla.com/pub --find-links http://pypi.pvt.build.mozilla.org/pub --find-links http://pypi.pub.build.mozilla.org/pub 10:15:21 INFO - Using env: {'DISPLAY': ':0', 10:15:21 INFO - 'HOME': '/home/cltbld', 10:15:21 INFO - 'LANG': 'en_US.UTF-8', 10:15:21 INFO - 'LOGNAME': 'cltbld', 10:15:21 INFO - 'MAIL': '/var/mail/cltbld', 10:15:21 INFO - 'NODE_PATH': '/usr/lib/nodejs:/usr/lib/node_modules:/usr/share/javascript', 10:15:21 INFO - 'PATH': '/usr/local/bin:/usr/local/bin:/usr/bin:/bin:/usr/local/games:/usr/games', 10:15:21 INFO - 'PROPERTIES_FILE': '/builds/slave/test/buildprops.json', 10:15:21 INFO - 'PWD': '/builds/slave/test', 10:15:21 INFO - 'SHELL': '/bin/bash', 10:15:21 INFO - 'SHLVL': '1', 10:15:21 INFO - 'TERM': 'linux', 10:15:21 INFO - 'TMOUT': '86400', 10:15:21 INFO - 'USER': 'cltbld', 10:15:21 INFO - 'XDG_SESSION_COOKIE': '9ca12473fbb1d023794ffd180000023c-1464192605.912671-1195279248', 10:15:21 INFO - '_': '/tools/buildbot/bin/python'} 10:15:22 INFO - Ignoring indexes: https://pypi.python.org/simple/ 10:15:22 INFO - Unpacking /builds/slave/test/build/tests/mozbase/manifestparser 10:15:22 INFO - Running setup.py (path:/tmp/pip-PbuFRM-build/setup.py) egg_info for package from file:///builds/slave/test/build/tests/mozbase/manifestparser 10:15:22 INFO - Unpacking /builds/slave/test/build/tests/mozbase/mozcrash 10:15:22 INFO - Running setup.py (path:/tmp/pip-dh7nxM-build/setup.py) egg_info for package from file:///builds/slave/test/build/tests/mozbase/mozcrash 10:15:22 INFO - Unpacking /builds/slave/test/build/tests/mozbase/mozdebug 10:15:22 INFO - Running setup.py (path:/tmp/pip-k9jVPa-build/setup.py) egg_info for package from file:///builds/slave/test/build/tests/mozbase/mozdebug 10:15:22 INFO - Unpacking /builds/slave/test/build/tests/mozbase/mozdevice 10:15:22 INFO - Running setup.py (path:/tmp/pip-0i6RMA-build/setup.py) egg_info for package from file:///builds/slave/test/build/tests/mozbase/mozdevice 10:15:22 INFO - Unpacking /builds/slave/test/build/tests/mozbase/mozfile 10:15:22 INFO - Running setup.py (path:/tmp/pip-rG1kST-build/setup.py) egg_info for package from file:///builds/slave/test/build/tests/mozbase/mozfile 10:15:22 INFO - Unpacking /builds/slave/test/build/tests/mozbase/mozhttpd 10:15:22 INFO - Running setup.py (path:/tmp/pip-8ndkfg-build/setup.py) egg_info for package from file:///builds/slave/test/build/tests/mozbase/mozhttpd 10:15:23 INFO - Unpacking /builds/slave/test/build/tests/mozbase/mozinfo 10:15:23 INFO - Running setup.py (path:/tmp/pip-mX1Ct4-build/setup.py) egg_info for package from file:///builds/slave/test/build/tests/mozbase/mozinfo 10:15:23 INFO - Unpacking /builds/slave/test/build/tests/mozbase/mozinstall 10:15:23 INFO - Running setup.py (path:/tmp/pip-dEHkHq-build/setup.py) egg_info for package from file:///builds/slave/test/build/tests/mozbase/mozinstall 10:15:23 INFO - Unpacking /builds/slave/test/build/tests/mozbase/mozleak 10:15:23 INFO - Running setup.py (path:/tmp/pip-4NgE1Q-build/setup.py) egg_info for package from file:///builds/slave/test/build/tests/mozbase/mozleak 10:15:23 INFO - Unpacking /builds/slave/test/build/tests/mozbase/mozlog 10:15:23 INFO - Running setup.py (path:/tmp/pip-TY9PS_-build/setup.py) egg_info for package from file:///builds/slave/test/build/tests/mozbase/mozlog 10:15:23 INFO - Unpacking /builds/slave/test/build/tests/mozbase/moznetwork 10:15:23 INFO - Running setup.py (path:/tmp/pip-jQLF5j-build/setup.py) egg_info for package from file:///builds/slave/test/build/tests/mozbase/moznetwork 10:15:23 INFO - Unpacking /builds/slave/test/build/tests/mozbase/mozprocess 10:15:23 INFO - Running setup.py (path:/tmp/pip-TmXMg1-build/setup.py) egg_info for package from file:///builds/slave/test/build/tests/mozbase/mozprocess 10:15:24 INFO - Unpacking /builds/slave/test/build/tests/mozbase/mozprofile 10:15:24 INFO - Running setup.py (path:/tmp/pip-aa5z7g-build/setup.py) egg_info for package from file:///builds/slave/test/build/tests/mozbase/mozprofile 10:15:24 INFO - Unpacking /builds/slave/test/build/tests/mozbase/mozrunner 10:15:24 INFO - Running setup.py (path:/tmp/pip-kT4Mqw-build/setup.py) egg_info for package from file:///builds/slave/test/build/tests/mozbase/mozrunner 10:15:24 INFO - Unpacking /builds/slave/test/build/tests/mozbase/mozscreenshot 10:15:24 INFO - Running setup.py (path:/tmp/pip-zlhDGn-build/setup.py) egg_info for package from file:///builds/slave/test/build/tests/mozbase/mozscreenshot 10:15:24 INFO - Unpacking /builds/slave/test/build/tests/mozbase/moztest 10:15:24 INFO - Running setup.py (path:/tmp/pip-bpSnfk-build/setup.py) egg_info for package from file:///builds/slave/test/build/tests/mozbase/moztest 10:15:24 INFO - Unpacking /builds/slave/test/build/tests/mozbase/mozversion 10:15:24 INFO - Running setup.py (path:/tmp/pip-M_jETa-build/setup.py) egg_info for package from file:///builds/slave/test/build/tests/mozbase/mozversion 10:15:24 INFO - Installing collected packages: manifestparser, mozcrash, mozdebug, mozdevice, mozfile, mozhttpd, mozinfo, mozInstall, mozleak, mozlog, moznetwork, mozprocess, mozprofile, mozrunner, mozscreenshot, moztest, mozversion 10:15:24 INFO - Running setup.py install for manifestparser 10:15:24 INFO - Installing manifestparser script to /builds/slave/test/build/venv/bin 10:15:24 INFO - Running setup.py install for mozcrash 10:15:25 INFO - Running setup.py install for mozdebug 10:15:25 INFO - Running setup.py install for mozdevice 10:15:25 INFO - Installing sutini script to /builds/slave/test/build/venv/bin 10:15:25 INFO - Installing dm script to /builds/slave/test/build/venv/bin 10:15:25 INFO - Running setup.py install for mozfile 10:15:25 INFO - Running setup.py install for mozhttpd 10:15:25 INFO - Installing mozhttpd script to /builds/slave/test/build/venv/bin 10:15:25 INFO - Running setup.py install for mozinfo 10:15:26 INFO - Installing mozinfo script to /builds/slave/test/build/venv/bin 10:15:26 INFO - Running setup.py install for mozInstall 10:15:26 INFO - Installing moz_remove_from_system script to /builds/slave/test/build/venv/bin 10:15:26 INFO - Installing mozuninstall script to /builds/slave/test/build/venv/bin 10:15:26 INFO - Installing mozinstall script to /builds/slave/test/build/venv/bin 10:15:26 INFO - Installing moz_add_to_system script to /builds/slave/test/build/venv/bin 10:15:26 INFO - Running setup.py install for mozleak 10:15:26 INFO - Running setup.py install for mozlog 10:15:26 INFO - Installing structlog script to /builds/slave/test/build/venv/bin 10:15:26 INFO - Running setup.py install for moznetwork 10:15:27 INFO - Installing moznetwork script to /builds/slave/test/build/venv/bin 10:15:27 INFO - Running setup.py install for mozprocess 10:15:27 INFO - Running setup.py install for mozprofile 10:15:27 INFO - Installing mozprofile script to /builds/slave/test/build/venv/bin 10:15:27 INFO - Installing diff-profiles script to /builds/slave/test/build/venv/bin 10:15:27 INFO - Installing view-profile script to /builds/slave/test/build/venv/bin 10:15:27 INFO - Running setup.py install for mozrunner 10:15:27 INFO - Installing mozrunner script to /builds/slave/test/build/venv/bin 10:15:27 INFO - Running setup.py install for mozscreenshot 10:15:27 INFO - Running setup.py install for moztest 10:15:28 INFO - Running setup.py install for mozversion 10:15:28 INFO - Installing mozversion script to /builds/slave/test/build/venv/bin 10:15:28 INFO - Successfully installed manifestparser mozcrash mozdebug mozdevice mozfile mozhttpd mozinfo mozInstall mozleak mozlog moznetwork mozprocess mozprofile mozrunner mozscreenshot moztest mozversion 10:15:28 INFO - Cleaning up... 10:15:28 INFO - Return code: 0 10:15:28 INFO - Installing None into virtualenv /builds/slave/test/build/venv 10:15:28 INFO - proxxy config: {'regions': ['.use1.', '.usw2.', '.scl3'], 'instances': ['proxxy1.srv.releng.use1.mozilla.com', 'proxxy1.srv.releng.usw2.mozilla.com', 'proxxy1.srv.releng.scl3.mozilla.com'], 'urls': [('http://ftp.mozilla.org', 'ftp.mozilla.org'), ('https://ftp.mozilla.org', 'ftp.mozilla.org'), ('https://ftp-ssl.mozilla.org', 'ftp.mozilla.org'), ('http://pvtbuilds.pvt.build.mozilla.org', 'pvtbuilds.mozilla.org'), ('http://pypi.pvt.build.mozilla.org', 'pypi.pvt.build.mozilla.org'), ('http://pypi.pub.build.mozilla.org', 'pypi.pub.build.mozilla.org'), ('https://queue.taskcluster.net', 'queue.taskcluster.net')]} 10:15:28 INFO - http://pypi.pvt.build.mozilla.org/pub matches http://pypi.pvt.build.mozilla.org 10:15:28 INFO - URL Candidate: http://pypi.pvt.build.mozilla.org.proxxy1.srv.releng.use1.mozilla.com/pub 10:15:28 INFO - proxxy config: {'regions': ['.use1.', '.usw2.', '.scl3'], 'instances': ['proxxy1.srv.releng.use1.mozilla.com', 'proxxy1.srv.releng.usw2.mozilla.com', 'proxxy1.srv.releng.scl3.mozilla.com'], 'urls': [('http://ftp.mozilla.org', 'ftp.mozilla.org'), ('https://ftp.mozilla.org', 'ftp.mozilla.org'), ('https://ftp-ssl.mozilla.org', 'ftp.mozilla.org'), ('http://pvtbuilds.pvt.build.mozilla.org', 'pvtbuilds.mozilla.org'), ('http://pypi.pvt.build.mozilla.org', 'pypi.pvt.build.mozilla.org'), ('http://pypi.pub.build.mozilla.org', 'pypi.pub.build.mozilla.org'), ('https://queue.taskcluster.net', 'queue.taskcluster.net')]} 10:15:28 INFO - http://pypi.pub.build.mozilla.org/pub matches http://pypi.pub.build.mozilla.org 10:15:28 INFO - URL Candidate: http://pypi.pub.build.mozilla.org.proxxy1.srv.releng.use1.mozilla.com/pub 10:15:28 INFO - retry: Calling run_command with args: [['/builds/slave/test/build/venv/bin/pip', 'install', '--timeout', '120', '-r', '/builds/slave/test/build/tests/config/mozbase_requirements.txt', '--no-index', '--find-links', 'http://pypi.pvt.build.mozilla.org.proxxy1.srv.releng.use1.mozilla.com/pub', '--find-links', 'http://pypi.pub.build.mozilla.org.proxxy1.srv.releng.use1.mozilla.com/pub', '--find-links', 'http://pypi.pvt.build.mozilla.org/pub', '--find-links', 'http://pypi.pub.build.mozilla.org/pub']], kwargs: {'error_level': 'warning', 'error_list': [{'substr': 'not found or a compiler error:', 'level': 'warning'}, {'regex': <_sre.SRE_Pattern object at 0xbaa1f0>, 'level': 'error'}, {'regex': <_sre.SRE_Pattern object at 0x7fd9095bee40>, 'level': 'warning'}, {'regex': <_sre.SRE_Pattern object at 0xcaff50>, 'level': 'debug'}, {'substr': 'command not found', 'level': 'error'}, {'regex': <_sre.SRE_Pattern object at 0xcac600>, 'level': 'warning'}, {'substr': 'Traceback (most recent call last)', 'level': 'error'}, {'substr': 'SyntaxError: ', 'level': 'error'}, {'substr': 'TypeError: ', 'level': 'error'}, {'substr': 'NameError: ', 'level': 'error'}, {'substr': 'ZeroDivisionError: ', 'level': 'error'}, {'regex': <_sre.SRE_Pattern object at 0xcadf60>, 'level': 'critical'}, {'regex': <_sre.SRE_Pattern object at 0xcae1e0>, 'level': 'critical'}], 'cwd': '/builds/slave/test/build/tests/config', 'env': {'LANG': 'en_US.UTF-8', 'TERM': 'linux', 'SHELL': '/bin/bash', 'XDG_SESSION_COOKIE': '9ca12473fbb1d023794ffd180000023c-1464192605.912671-1195279248', 'MAIL': '/var/mail/cltbld', 'SHLVL': '1', 'TMOUT': '86400', 'NODE_PATH': '/usr/lib/nodejs:/usr/lib/node_modules:/usr/share/javascript', 'PWD': '/builds/slave/test', 'LOGNAME': 'cltbld', 'USER': 'cltbld', 'PROPERTIES_FILE': '/builds/slave/test/buildprops.json', 'PATH': '/usr/local/bin:/usr/local/bin:/usr/bin:/bin:/usr/local/games:/usr/games', 'HOME': '/home/cltbld', 'DISPLAY': ':0', '_': '/tools/buildbot/bin/python'}}, attempt #1 10:15:28 INFO - Running command: ['/builds/slave/test/build/venv/bin/pip', 'install', '--timeout', '120', '-r', '/builds/slave/test/build/tests/config/mozbase_requirements.txt', '--no-index', '--find-links', 'http://pypi.pvt.build.mozilla.org.proxxy1.srv.releng.use1.mozilla.com/pub', '--find-links', 'http://pypi.pub.build.mozilla.org.proxxy1.srv.releng.use1.mozilla.com/pub', '--find-links', 'http://pypi.pvt.build.mozilla.org/pub', '--find-links', 'http://pypi.pub.build.mozilla.org/pub'] in /builds/slave/test/build/tests/config 10:15:28 INFO - Copy/paste: /builds/slave/test/build/venv/bin/pip install --timeout 120 -r /builds/slave/test/build/tests/config/mozbase_requirements.txt --no-index --find-links http://pypi.pvt.build.mozilla.org.proxxy1.srv.releng.use1.mozilla.com/pub --find-links http://pypi.pub.build.mozilla.org.proxxy1.srv.releng.use1.mozilla.com/pub --find-links http://pypi.pvt.build.mozilla.org/pub --find-links http://pypi.pub.build.mozilla.org/pub 10:15:28 INFO - Using env: {'DISPLAY': ':0', 10:15:28 INFO - 'HOME': '/home/cltbld', 10:15:28 INFO - 'LANG': 'en_US.UTF-8', 10:15:28 INFO - 'LOGNAME': 'cltbld', 10:15:28 INFO - 'MAIL': '/var/mail/cltbld', 10:15:28 INFO - 'NODE_PATH': '/usr/lib/nodejs:/usr/lib/node_modules:/usr/share/javascript', 10:15:28 INFO - 'PATH': '/usr/local/bin:/usr/local/bin:/usr/bin:/bin:/usr/local/games:/usr/games', 10:15:28 INFO - 'PROPERTIES_FILE': '/builds/slave/test/buildprops.json', 10:15:28 INFO - 'PWD': '/builds/slave/test', 10:15:28 INFO - 'SHELL': '/bin/bash', 10:15:28 INFO - 'SHLVL': '1', 10:15:28 INFO - 'TERM': 'linux', 10:15:28 INFO - 'TMOUT': '86400', 10:15:28 INFO - 'USER': 'cltbld', 10:15:28 INFO - 'XDG_SESSION_COOKIE': '9ca12473fbb1d023794ffd180000023c-1464192605.912671-1195279248', 10:15:28 INFO - '_': '/tools/buildbot/bin/python'} 10:15:28 INFO - Ignoring indexes: https://pypi.python.org/simple/ 10:15:28 INFO - Unpacking /builds/slave/test/build/tests/mozbase/manifestparser 10:15:28 INFO - Running setup.py (path:/tmp/pip-SIUqxy-build/setup.py) egg_info for package from file:///builds/slave/test/build/tests/mozbase/manifestparser 10:15:28 INFO - Requirement already satisfied (use --upgrade to upgrade): manifestparser==1.1 from file:///builds/slave/test/build/tests/mozbase/manifestparser in /builds/slave/test/build/venv/lib/python2.7/site-packages (from -r /builds/slave/test/build/tests/config/mozbase_requirements.txt (line 1)) 10:15:28 INFO - Unpacking /builds/slave/test/build/tests/mozbase/mozcrash 10:15:28 INFO - Running setup.py (path:/tmp/pip-riAe_r-build/setup.py) egg_info for package from file:///builds/slave/test/build/tests/mozbase/mozcrash 10:15:29 INFO - Requirement already satisfied (use --upgrade to upgrade): mozcrash==0.17 from file:///builds/slave/test/build/tests/mozbase/mozcrash in /builds/slave/test/build/venv/lib/python2.7/site-packages (from -r /builds/slave/test/build/tests/config/mozbase_requirements.txt (line 2)) 10:15:29 INFO - Unpacking /builds/slave/test/build/tests/mozbase/mozdebug 10:15:29 INFO - Running setup.py (path:/tmp/pip-TAyYB9-build/setup.py) egg_info for package from file:///builds/slave/test/build/tests/mozbase/mozdebug 10:15:29 INFO - Requirement already satisfied (use --upgrade to upgrade): mozdebug==0.1 from file:///builds/slave/test/build/tests/mozbase/mozdebug in /builds/slave/test/build/venv/lib/python2.7/site-packages (from -r /builds/slave/test/build/tests/config/mozbase_requirements.txt (line 3)) 10:15:29 INFO - Unpacking /builds/slave/test/build/tests/mozbase/mozdevice 10:15:29 INFO - Running setup.py (path:/tmp/pip-Q1BTua-build/setup.py) egg_info for package from file:///builds/slave/test/build/tests/mozbase/mozdevice 10:15:29 INFO - Requirement already satisfied (use --upgrade to upgrade): mozdevice==0.48 from file:///builds/slave/test/build/tests/mozbase/mozdevice in /builds/slave/test/build/venv/lib/python2.7/site-packages (from -r /builds/slave/test/build/tests/config/mozbase_requirements.txt (line 4)) 10:15:29 INFO - Unpacking /builds/slave/test/build/tests/mozbase/mozfile 10:15:29 INFO - Running setup.py (path:/tmp/pip-K4rexX-build/setup.py) egg_info for package from file:///builds/slave/test/build/tests/mozbase/mozfile 10:15:29 INFO - Requirement already satisfied (use --upgrade to upgrade): mozfile==1.2 from file:///builds/slave/test/build/tests/mozbase/mozfile in /builds/slave/test/build/venv/lib/python2.7/site-packages (from -r /builds/slave/test/build/tests/config/mozbase_requirements.txt (line 5)) 10:15:29 INFO - Unpacking /builds/slave/test/build/tests/mozbase/mozhttpd 10:15:29 INFO - Running setup.py (path:/tmp/pip-xOVp4G-build/setup.py) egg_info for package from file:///builds/slave/test/build/tests/mozbase/mozhttpd 10:15:29 INFO - Requirement already satisfied (use --upgrade to upgrade): mozhttpd==0.7 from file:///builds/slave/test/build/tests/mozbase/mozhttpd in /builds/slave/test/build/venv/lib/python2.7/site-packages (from -r /builds/slave/test/build/tests/config/mozbase_requirements.txt (line 6)) 10:15:29 INFO - Unpacking /builds/slave/test/build/tests/mozbase/mozinfo 10:15:29 INFO - Running setup.py (path:/tmp/pip-ZnWvEe-build/setup.py) egg_info for package from file:///builds/slave/test/build/tests/mozbase/mozinfo 10:15:29 INFO - Requirement already satisfied (use --upgrade to upgrade): mozinfo==0.9 from file:///builds/slave/test/build/tests/mozbase/mozinfo in /builds/slave/test/build/venv/lib/python2.7/site-packages (from -r /builds/slave/test/build/tests/config/mozbase_requirements.txt (line 7)) 10:15:29 INFO - Unpacking /builds/slave/test/build/tests/mozbase/mozinstall 10:15:29 INFO - Running setup.py (path:/tmp/pip-925drL-build/setup.py) egg_info for package from file:///builds/slave/test/build/tests/mozbase/mozinstall 10:15:29 INFO - Requirement already satisfied (use --upgrade to upgrade): mozInstall==1.12 from file:///builds/slave/test/build/tests/mozbase/mozinstall in /builds/slave/test/build/venv/lib/python2.7/site-packages (from -r /builds/slave/test/build/tests/config/mozbase_requirements.txt (line 8)) 10:15:29 INFO - Unpacking /builds/slave/test/build/tests/mozbase/mozleak 10:15:29 INFO - Running setup.py (path:/tmp/pip-rRMyzY-build/setup.py) egg_info for package from file:///builds/slave/test/build/tests/mozbase/mozleak 10:15:30 INFO - Requirement already satisfied (use --upgrade to upgrade): mozleak==0.1 from file:///builds/slave/test/build/tests/mozbase/mozleak in /builds/slave/test/build/venv/lib/python2.7/site-packages (from -r /builds/slave/test/build/tests/config/mozbase_requirements.txt (line 9)) 10:15:30 INFO - Unpacking /builds/slave/test/build/tests/mozbase/mozlog 10:15:30 INFO - Running setup.py (path:/tmp/pip-HP_r9t-build/setup.py) egg_info for package from file:///builds/slave/test/build/tests/mozbase/mozlog 10:15:30 INFO - Requirement already satisfied (use --upgrade to upgrade): mozlog==3.2 from file:///builds/slave/test/build/tests/mozbase/mozlog in /builds/slave/test/build/venv/lib/python2.7/site-packages (from -r /builds/slave/test/build/tests/config/mozbase_requirements.txt (line 10)) 10:15:30 INFO - Unpacking /builds/slave/test/build/tests/mozbase/moznetwork 10:15:30 INFO - Running setup.py (path:/tmp/pip-TANOsq-build/setup.py) egg_info for package from file:///builds/slave/test/build/tests/mozbase/moznetwork 10:15:30 INFO - Requirement already satisfied (use --upgrade to upgrade): moznetwork==0.27 from file:///builds/slave/test/build/tests/mozbase/moznetwork in /builds/slave/test/build/venv/lib/python2.7/site-packages (from -r /builds/slave/test/build/tests/config/mozbase_requirements.txt (line 11)) 10:15:30 INFO - Unpacking /builds/slave/test/build/tests/mozbase/mozprocess 10:15:30 INFO - Running setup.py (path:/tmp/pip-yPa_Si-build/setup.py) egg_info for package from file:///builds/slave/test/build/tests/mozbase/mozprocess 10:15:30 INFO - Requirement already satisfied (use --upgrade to upgrade): mozprocess==0.22 from file:///builds/slave/test/build/tests/mozbase/mozprocess in /builds/slave/test/build/venv/lib/python2.7/site-packages (from -r /builds/slave/test/build/tests/config/mozbase_requirements.txt (line 12)) 10:15:30 INFO - Unpacking /builds/slave/test/build/tests/mozbase/mozprofile 10:15:30 INFO - Running setup.py (path:/tmp/pip-WNc6bg-build/setup.py) egg_info for package from file:///builds/slave/test/build/tests/mozbase/mozprofile 10:15:30 INFO - Requirement already satisfied (use --upgrade to upgrade): mozprofile==0.28 from file:///builds/slave/test/build/tests/mozbase/mozprofile in /builds/slave/test/build/venv/lib/python2.7/site-packages (from -r /builds/slave/test/build/tests/config/mozbase_requirements.txt (line 13)) 10:15:30 INFO - Unpacking /builds/slave/test/build/tests/mozbase/mozrunner 10:15:30 INFO - Running setup.py (path:/tmp/pip-pOHL16-build/setup.py) egg_info for package from file:///builds/slave/test/build/tests/mozbase/mozrunner 10:15:30 INFO - Requirement already satisfied (use --upgrade to upgrade): mozrunner==6.11 from file:///builds/slave/test/build/tests/mozbase/mozrunner in /builds/slave/test/build/venv/lib/python2.7/site-packages (from -r /builds/slave/test/build/tests/config/mozbase_requirements.txt (line 14)) 10:15:30 INFO - Unpacking /builds/slave/test/build/tests/mozbase/mozscreenshot 10:15:30 INFO - Running setup.py (path:/tmp/pip-RidEGl-build/setup.py) egg_info for package from file:///builds/slave/test/build/tests/mozbase/mozscreenshot 10:15:31 INFO - Requirement already satisfied (use --upgrade to upgrade): mozscreenshot==0.1 from file:///builds/slave/test/build/tests/mozbase/mozscreenshot in /builds/slave/test/build/venv/lib/python2.7/site-packages (from -r /builds/slave/test/build/tests/config/mozbase_requirements.txt (line 15)) 10:15:31 INFO - Unpacking /builds/slave/test/build/tests/mozbase/moztest 10:15:31 INFO - Running setup.py (path:/tmp/pip-DPEzoU-build/setup.py) egg_info for package from file:///builds/slave/test/build/tests/mozbase/moztest 10:15:31 INFO - Requirement already satisfied (use --upgrade to upgrade): moztest==0.7 from file:///builds/slave/test/build/tests/mozbase/moztest in /builds/slave/test/build/venv/lib/python2.7/site-packages (from -r /builds/slave/test/build/tests/config/mozbase_requirements.txt (line 16)) 10:15:31 INFO - Unpacking /builds/slave/test/build/tests/mozbase/mozversion 10:15:31 INFO - Running setup.py (path:/tmp/pip-G7ccg7-build/setup.py) egg_info for package from file:///builds/slave/test/build/tests/mozbase/mozversion 10:15:31 INFO - Requirement already satisfied (use --upgrade to upgrade): mozversion==1.4 from file:///builds/slave/test/build/tests/mozbase/mozversion in /builds/slave/test/build/venv/lib/python2.7/site-packages (from -r /builds/slave/test/build/tests/config/mozbase_requirements.txt (line 17)) 10:15:31 INFO - Requirement already satisfied (use --upgrade to upgrade): mozfile>=1.0 in /builds/slave/test/build/venv/lib/python2.7/site-packages (from mozcrash==0.17->-r /builds/slave/test/build/tests/config/mozbase_requirements.txt (line 2)) 10:15:31 INFO - Requirement already satisfied (use --upgrade to upgrade): mozlog>=3.0 in /builds/slave/test/build/venv/lib/python2.7/site-packages (from mozcrash==0.17->-r /builds/slave/test/build/tests/config/mozbase_requirements.txt (line 2)) 10:15:31 INFO - Requirement already satisfied (use --upgrade to upgrade): mozinfo in /builds/slave/test/build/venv/lib/python2.7/site-packages (from mozdebug==0.1->-r /builds/slave/test/build/tests/config/mozbase_requirements.txt (line 3)) 10:15:31 INFO - Requirement already satisfied (use --upgrade to upgrade): moznetwork>=0.24 in /builds/slave/test/build/venv/lib/python2.7/site-packages (from mozdevice==0.48->-r /builds/slave/test/build/tests/config/mozbase_requirements.txt (line 4)) 10:15:31 INFO - Requirement already satisfied (use --upgrade to upgrade): mozprocess>=0.19 in /builds/slave/test/build/venv/lib/python2.7/site-packages (from mozdevice==0.48->-r /builds/slave/test/build/tests/config/mozbase_requirements.txt (line 4)) 10:15:31 INFO - Downloading/unpacking blessings>=1.3 (from mozlog==3.2->-r /builds/slave/test/build/tests/config/mozbase_requirements.txt (line 10)) 10:15:31 INFO - http://pypi.pvt.build.mozilla.org/pub uses an insecure transport scheme (http). Consider using https if pypi.pvt.build.mozilla.org has it available 10:15:31 INFO - http://pypi.pub.build.mozilla.org/pub uses an insecure transport scheme (http). Consider using https if pypi.pub.build.mozilla.org has it available 10:15:31 INFO - http://pypi.pvt.build.mozilla.org.proxxy1.srv.releng.use1.mozilla.com/pub uses an insecure transport scheme (http). Consider using https if pypi.pvt.build.mozilla.org.proxxy1.srv.releng.use1.mozilla.com has it available 10:15:31 INFO - http://pypi.pub.build.mozilla.org.proxxy1.srv.releng.use1.mozilla.com/pub uses an insecure transport scheme (http). Consider using https if pypi.pub.build.mozilla.org.proxxy1.srv.releng.use1.mozilla.com has it available 10:15:31 INFO - http://pypi.pvt.build.mozilla.org/pub uses an insecure transport scheme (http). Consider using https if pypi.pvt.build.mozilla.org has it available 10:15:31 INFO - http://pypi.pub.build.mozilla.org/pub uses an insecure transport scheme (http). Consider using https if pypi.pub.build.mozilla.org has it available 10:15:36 INFO - Downloading blessings-1.6.tar.gz 10:15:36 INFO - Running setup.py (path:/builds/slave/test/build/venv/build/blessings/setup.py) egg_info for package blessings 10:15:36 INFO - Installing collected packages: blessings 10:15:36 INFO - Running setup.py install for blessings 10:15:36 INFO - Successfully installed blessings 10:15:36 INFO - Cleaning up... 10:15:37 INFO - Return code: 0 10:15:37 INFO - Installing pip>=1.5 into virtualenv /builds/slave/test/build/venv 10:15:37 INFO - proxxy config: {'regions': ['.use1.', '.usw2.', '.scl3'], 'instances': ['proxxy1.srv.releng.use1.mozilla.com', 'proxxy1.srv.releng.usw2.mozilla.com', 'proxxy1.srv.releng.scl3.mozilla.com'], 'urls': [('http://ftp.mozilla.org', 'ftp.mozilla.org'), ('https://ftp.mozilla.org', 'ftp.mozilla.org'), ('https://ftp-ssl.mozilla.org', 'ftp.mozilla.org'), ('http://pvtbuilds.pvt.build.mozilla.org', 'pvtbuilds.mozilla.org'), ('http://pypi.pvt.build.mozilla.org', 'pypi.pvt.build.mozilla.org'), ('http://pypi.pub.build.mozilla.org', 'pypi.pub.build.mozilla.org'), ('https://queue.taskcluster.net', 'queue.taskcluster.net')]} 10:15:37 INFO - http://pypi.pvt.build.mozilla.org/pub matches http://pypi.pvt.build.mozilla.org 10:15:37 INFO - URL Candidate: http://pypi.pvt.build.mozilla.org.proxxy1.srv.releng.use1.mozilla.com/pub 10:15:37 INFO - proxxy config: {'regions': ['.use1.', '.usw2.', '.scl3'], 'instances': ['proxxy1.srv.releng.use1.mozilla.com', 'proxxy1.srv.releng.usw2.mozilla.com', 'proxxy1.srv.releng.scl3.mozilla.com'], 'urls': [('http://ftp.mozilla.org', 'ftp.mozilla.org'), ('https://ftp.mozilla.org', 'ftp.mozilla.org'), ('https://ftp-ssl.mozilla.org', 'ftp.mozilla.org'), ('http://pvtbuilds.pvt.build.mozilla.org', 'pvtbuilds.mozilla.org'), ('http://pypi.pvt.build.mozilla.org', 'pypi.pvt.build.mozilla.org'), ('http://pypi.pub.build.mozilla.org', 'pypi.pub.build.mozilla.org'), ('https://queue.taskcluster.net', 'queue.taskcluster.net')]} 10:15:37 INFO - http://pypi.pub.build.mozilla.org/pub matches http://pypi.pub.build.mozilla.org 10:15:37 INFO - URL Candidate: http://pypi.pub.build.mozilla.org.proxxy1.srv.releng.use1.mozilla.com/pub 10:15:37 INFO - retry: Calling run_command with args: [['/builds/slave/test/build/venv/bin/pip', 'install', '--timeout', '120', '--no-index', '--find-links', 'http://pypi.pvt.build.mozilla.org.proxxy1.srv.releng.use1.mozilla.com/pub', '--find-links', 'http://pypi.pub.build.mozilla.org.proxxy1.srv.releng.use1.mozilla.com/pub', '--find-links', 'http://pypi.pvt.build.mozilla.org/pub', '--find-links', 'http://pypi.pub.build.mozilla.org/pub', 'pip>=1.5']], kwargs: {'error_level': 'warning', 'error_list': [{'substr': 'not found or a compiler error:', 'level': 'warning'}, {'regex': <_sre.SRE_Pattern object at 0xbaa1f0>, 'level': 'error'}, {'regex': <_sre.SRE_Pattern object at 0x7fd9095bee40>, 'level': 'warning'}, {'regex': <_sre.SRE_Pattern object at 0xcaff50>, 'level': 'debug'}, {'substr': 'command not found', 'level': 'error'}, {'regex': <_sre.SRE_Pattern object at 0xcac600>, 'level': 'warning'}, {'substr': 'Traceback (most recent call last)', 'level': 'error'}, {'substr': 'SyntaxError: ', 'level': 'error'}, {'substr': 'TypeError: ', 'level': 'error'}, {'substr': 'NameError: ', 'level': 'error'}, {'substr': 'ZeroDivisionError: ', 'level': 'error'}, {'regex': <_sre.SRE_Pattern object at 0xcadf60>, 'level': 'critical'}, {'regex': <_sre.SRE_Pattern object at 0xcae1e0>, 'level': 'critical'}], 'cwd': '/builds/slave/test/build', 'env': {'LANG': 'en_US.UTF-8', 'TERM': 'linux', 'SHELL': '/bin/bash', 'XDG_SESSION_COOKIE': '9ca12473fbb1d023794ffd180000023c-1464192605.912671-1195279248', 'MAIL': '/var/mail/cltbld', 'SHLVL': '1', 'TMOUT': '86400', 'NODE_PATH': '/usr/lib/nodejs:/usr/lib/node_modules:/usr/share/javascript', 'PWD': '/builds/slave/test', 'LOGNAME': 'cltbld', 'USER': 'cltbld', 'PROPERTIES_FILE': '/builds/slave/test/buildprops.json', 'PATH': '/usr/local/bin:/usr/local/bin:/usr/bin:/bin:/usr/local/games:/usr/games', 'HOME': '/home/cltbld', 'DISPLAY': ':0', '_': '/tools/buildbot/bin/python'}}, attempt #1 10:15:37 INFO - Running command: ['/builds/slave/test/build/venv/bin/pip', 'install', '--timeout', '120', '--no-index', '--find-links', 'http://pypi.pvt.build.mozilla.org.proxxy1.srv.releng.use1.mozilla.com/pub', '--find-links', 'http://pypi.pub.build.mozilla.org.proxxy1.srv.releng.use1.mozilla.com/pub', '--find-links', 'http://pypi.pvt.build.mozilla.org/pub', '--find-links', 'http://pypi.pub.build.mozilla.org/pub', 'pip>=1.5'] in /builds/slave/test/build 10:15:37 INFO - Copy/paste: /builds/slave/test/build/venv/bin/pip install --timeout 120 --no-index --find-links http://pypi.pvt.build.mozilla.org.proxxy1.srv.releng.use1.mozilla.com/pub --find-links http://pypi.pub.build.mozilla.org.proxxy1.srv.releng.use1.mozilla.com/pub --find-links http://pypi.pvt.build.mozilla.org/pub --find-links http://pypi.pub.build.mozilla.org/pub pip>=1.5 10:15:37 INFO - Using env: {'DISPLAY': ':0', 10:15:37 INFO - 'HOME': '/home/cltbld', 10:15:37 INFO - 'LANG': 'en_US.UTF-8', 10:15:37 INFO - 'LOGNAME': 'cltbld', 10:15:37 INFO - 'MAIL': '/var/mail/cltbld', 10:15:37 INFO - 'NODE_PATH': '/usr/lib/nodejs:/usr/lib/node_modules:/usr/share/javascript', 10:15:37 INFO - 'PATH': '/usr/local/bin:/usr/local/bin:/usr/bin:/bin:/usr/local/games:/usr/games', 10:15:37 INFO - 'PROPERTIES_FILE': '/builds/slave/test/buildprops.json', 10:15:37 INFO - 'PWD': '/builds/slave/test', 10:15:37 INFO - 'SHELL': '/bin/bash', 10:15:37 INFO - 'SHLVL': '1', 10:15:37 INFO - 'TERM': 'linux', 10:15:37 INFO - 'TMOUT': '86400', 10:15:37 INFO - 'USER': 'cltbld', 10:15:37 INFO - 'XDG_SESSION_COOKIE': '9ca12473fbb1d023794ffd180000023c-1464192605.912671-1195279248', 10:15:37 INFO - '_': '/tools/buildbot/bin/python'} 10:15:37 INFO - Ignoring indexes: https://pypi.python.org/simple/ 10:15:37 INFO - Requirement already satisfied (use --upgrade to upgrade): pip>=1.5 in ./venv/lib/python2.7/site-packages/pip-1.5.5-py2.7.egg 10:15:37 INFO - Cleaning up... 10:15:37 INFO - Return code: 0 10:15:37 INFO - Installing psutil==3.1.1 into virtualenv /builds/slave/test/build/venv 10:15:37 INFO - proxxy config: {'regions': ['.use1.', '.usw2.', '.scl3'], 'instances': ['proxxy1.srv.releng.use1.mozilla.com', 'proxxy1.srv.releng.usw2.mozilla.com', 'proxxy1.srv.releng.scl3.mozilla.com'], 'urls': [('http://ftp.mozilla.org', 'ftp.mozilla.org'), ('https://ftp.mozilla.org', 'ftp.mozilla.org'), ('https://ftp-ssl.mozilla.org', 'ftp.mozilla.org'), ('http://pvtbuilds.pvt.build.mozilla.org', 'pvtbuilds.mozilla.org'), ('http://pypi.pvt.build.mozilla.org', 'pypi.pvt.build.mozilla.org'), ('http://pypi.pub.build.mozilla.org', 'pypi.pub.build.mozilla.org'), ('https://queue.taskcluster.net', 'queue.taskcluster.net')]} 10:15:37 INFO - http://pypi.pvt.build.mozilla.org/pub matches http://pypi.pvt.build.mozilla.org 10:15:37 INFO - URL Candidate: http://pypi.pvt.build.mozilla.org.proxxy1.srv.releng.use1.mozilla.com/pub 10:15:37 INFO - proxxy config: {'regions': ['.use1.', '.usw2.', '.scl3'], 'instances': ['proxxy1.srv.releng.use1.mozilla.com', 'proxxy1.srv.releng.usw2.mozilla.com', 'proxxy1.srv.releng.scl3.mozilla.com'], 'urls': [('http://ftp.mozilla.org', 'ftp.mozilla.org'), ('https://ftp.mozilla.org', 'ftp.mozilla.org'), ('https://ftp-ssl.mozilla.org', 'ftp.mozilla.org'), ('http://pvtbuilds.pvt.build.mozilla.org', 'pvtbuilds.mozilla.org'), ('http://pypi.pvt.build.mozilla.org', 'pypi.pvt.build.mozilla.org'), ('http://pypi.pub.build.mozilla.org', 'pypi.pub.build.mozilla.org'), ('https://queue.taskcluster.net', 'queue.taskcluster.net')]} 10:15:37 INFO - http://pypi.pub.build.mozilla.org/pub matches http://pypi.pub.build.mozilla.org 10:15:37 INFO - URL Candidate: http://pypi.pub.build.mozilla.org.proxxy1.srv.releng.use1.mozilla.com/pub 10:15:37 INFO - retry: Calling run_command with args: [['/builds/slave/test/build/venv/bin/pip', 'install', '--timeout', '120', '--no-index', '--find-links', 'http://pypi.pvt.build.mozilla.org.proxxy1.srv.releng.use1.mozilla.com/pub', '--find-links', 'http://pypi.pub.build.mozilla.org.proxxy1.srv.releng.use1.mozilla.com/pub', '--find-links', 'http://pypi.pvt.build.mozilla.org/pub', '--find-links', 'http://pypi.pub.build.mozilla.org/pub', 'psutil==3.1.1']], kwargs: {'error_level': 'warning', 'error_list': [{'substr': 'not found or a compiler error:', 'level': 'warning'}, {'regex': <_sre.SRE_Pattern object at 0xbaa1f0>, 'level': 'error'}, {'regex': <_sre.SRE_Pattern object at 0x7fd9095bee40>, 'level': 'warning'}, {'regex': <_sre.SRE_Pattern object at 0xcaff50>, 'level': 'debug'}, {'substr': 'command not found', 'level': 'error'}, {'regex': <_sre.SRE_Pattern object at 0xcac600>, 'level': 'warning'}, {'substr': 'Traceback (most recent call last)', 'level': 'error'}, {'substr': 'SyntaxError: ', 'level': 'error'}, {'substr': 'TypeError: ', 'level': 'error'}, {'substr': 'NameError: ', 'level': 'error'}, {'substr': 'ZeroDivisionError: ', 'level': 'error'}, {'regex': <_sre.SRE_Pattern object at 0xcadf60>, 'level': 'critical'}, {'regex': <_sre.SRE_Pattern object at 0xcae1e0>, 'level': 'critical'}], 'cwd': '/builds/slave/test/build', 'env': {'LANG': 'en_US.UTF-8', 'TERM': 'linux', 'SHELL': '/bin/bash', 'XDG_SESSION_COOKIE': '9ca12473fbb1d023794ffd180000023c-1464192605.912671-1195279248', 'MAIL': '/var/mail/cltbld', 'SHLVL': '1', 'TMOUT': '86400', 'NODE_PATH': '/usr/lib/nodejs:/usr/lib/node_modules:/usr/share/javascript', 'PWD': '/builds/slave/test', 'LOGNAME': 'cltbld', 'USER': 'cltbld', 'PROPERTIES_FILE': '/builds/slave/test/buildprops.json', 'PATH': '/usr/local/bin:/usr/local/bin:/usr/bin:/bin:/usr/local/games:/usr/games', 'HOME': '/home/cltbld', 'DISPLAY': ':0', '_': '/tools/buildbot/bin/python'}}, attempt #1 10:15:37 INFO - Running command: ['/builds/slave/test/build/venv/bin/pip', 'install', '--timeout', '120', '--no-index', '--find-links', 'http://pypi.pvt.build.mozilla.org.proxxy1.srv.releng.use1.mozilla.com/pub', '--find-links', 'http://pypi.pub.build.mozilla.org.proxxy1.srv.releng.use1.mozilla.com/pub', '--find-links', 'http://pypi.pvt.build.mozilla.org/pub', '--find-links', 'http://pypi.pub.build.mozilla.org/pub', 'psutil==3.1.1'] in /builds/slave/test/build 10:15:37 INFO - Copy/paste: /builds/slave/test/build/venv/bin/pip install --timeout 120 --no-index --find-links http://pypi.pvt.build.mozilla.org.proxxy1.srv.releng.use1.mozilla.com/pub --find-links http://pypi.pub.build.mozilla.org.proxxy1.srv.releng.use1.mozilla.com/pub --find-links http://pypi.pvt.build.mozilla.org/pub --find-links http://pypi.pub.build.mozilla.org/pub psutil==3.1.1 10:15:37 INFO - Using env: {'DISPLAY': ':0', 10:15:37 INFO - 'HOME': '/home/cltbld', 10:15:37 INFO - 'LANG': 'en_US.UTF-8', 10:15:37 INFO - 'LOGNAME': 'cltbld', 10:15:37 INFO - 'MAIL': '/var/mail/cltbld', 10:15:37 INFO - 'NODE_PATH': '/usr/lib/nodejs:/usr/lib/node_modules:/usr/share/javascript', 10:15:37 INFO - 'PATH': '/usr/local/bin:/usr/local/bin:/usr/bin:/bin:/usr/local/games:/usr/games', 10:15:37 INFO - 'PROPERTIES_FILE': '/builds/slave/test/buildprops.json', 10:15:37 INFO - 'PWD': '/builds/slave/test', 10:15:37 INFO - 'SHELL': '/bin/bash', 10:15:37 INFO - 'SHLVL': '1', 10:15:37 INFO - 'TERM': 'linux', 10:15:37 INFO - 'TMOUT': '86400', 10:15:37 INFO - 'USER': 'cltbld', 10:15:37 INFO - 'XDG_SESSION_COOKIE': '9ca12473fbb1d023794ffd180000023c-1464192605.912671-1195279248', 10:15:37 INFO - '_': '/tools/buildbot/bin/python'} 10:15:37 INFO - Ignoring indexes: https://pypi.python.org/simple/ 10:15:37 INFO - Requirement already satisfied (use --upgrade to upgrade): psutil==3.1.1 in ./venv/lib/python2.7/site-packages 10:15:37 INFO - Cleaning up... 10:15:38 INFO - Return code: 0 10:15:38 INFO - Installing mock into virtualenv /builds/slave/test/build/venv 10:15:38 INFO - proxxy config: {'regions': ['.use1.', '.usw2.', '.scl3'], 'instances': ['proxxy1.srv.releng.use1.mozilla.com', 'proxxy1.srv.releng.usw2.mozilla.com', 'proxxy1.srv.releng.scl3.mozilla.com'], 'urls': [('http://ftp.mozilla.org', 'ftp.mozilla.org'), ('https://ftp.mozilla.org', 'ftp.mozilla.org'), ('https://ftp-ssl.mozilla.org', 'ftp.mozilla.org'), ('http://pvtbuilds.pvt.build.mozilla.org', 'pvtbuilds.mozilla.org'), ('http://pypi.pvt.build.mozilla.org', 'pypi.pvt.build.mozilla.org'), ('http://pypi.pub.build.mozilla.org', 'pypi.pub.build.mozilla.org'), ('https://queue.taskcluster.net', 'queue.taskcluster.net')]} 10:15:38 INFO - http://pypi.pvt.build.mozilla.org/pub matches http://pypi.pvt.build.mozilla.org 10:15:38 INFO - URL Candidate: http://pypi.pvt.build.mozilla.org.proxxy1.srv.releng.use1.mozilla.com/pub 10:15:38 INFO - proxxy config: {'regions': ['.use1.', '.usw2.', '.scl3'], 'instances': ['proxxy1.srv.releng.use1.mozilla.com', 'proxxy1.srv.releng.usw2.mozilla.com', 'proxxy1.srv.releng.scl3.mozilla.com'], 'urls': [('http://ftp.mozilla.org', 'ftp.mozilla.org'), ('https://ftp.mozilla.org', 'ftp.mozilla.org'), ('https://ftp-ssl.mozilla.org', 'ftp.mozilla.org'), ('http://pvtbuilds.pvt.build.mozilla.org', 'pvtbuilds.mozilla.org'), ('http://pypi.pvt.build.mozilla.org', 'pypi.pvt.build.mozilla.org'), ('http://pypi.pub.build.mozilla.org', 'pypi.pub.build.mozilla.org'), ('https://queue.taskcluster.net', 'queue.taskcluster.net')]} 10:15:38 INFO - http://pypi.pub.build.mozilla.org/pub matches http://pypi.pub.build.mozilla.org 10:15:38 INFO - URL Candidate: http://pypi.pub.build.mozilla.org.proxxy1.srv.releng.use1.mozilla.com/pub 10:15:38 INFO - retry: Calling run_command with args: [['/builds/slave/test/build/venv/bin/pip', 'install', '--timeout', '120', '--no-index', '--find-links', 'http://pypi.pvt.build.mozilla.org.proxxy1.srv.releng.use1.mozilla.com/pub', '--find-links', 'http://pypi.pub.build.mozilla.org.proxxy1.srv.releng.use1.mozilla.com/pub', '--find-links', 'http://pypi.pvt.build.mozilla.org/pub', '--find-links', 'http://pypi.pub.build.mozilla.org/pub', 'mock']], kwargs: {'error_level': 'warning', 'error_list': [{'substr': 'not found or a compiler error:', 'level': 'warning'}, {'regex': <_sre.SRE_Pattern object at 0xbaa1f0>, 'level': 'error'}, {'regex': <_sre.SRE_Pattern object at 0x7fd9095bee40>, 'level': 'warning'}, {'regex': <_sre.SRE_Pattern object at 0xcaff50>, 'level': 'debug'}, {'substr': 'command not found', 'level': 'error'}, {'regex': <_sre.SRE_Pattern object at 0xcac600>, 'level': 'warning'}, {'substr': 'Traceback (most recent call last)', 'level': 'error'}, {'substr': 'SyntaxError: ', 'level': 'error'}, {'substr': 'TypeError: ', 'level': 'error'}, {'substr': 'NameError: ', 'level': 'error'}, {'substr': 'ZeroDivisionError: ', 'level': 'error'}, {'regex': <_sre.SRE_Pattern object at 0xcadf60>, 'level': 'critical'}, {'regex': <_sre.SRE_Pattern object at 0xcae1e0>, 'level': 'critical'}], 'cwd': '/builds/slave/test/build', 'env': {'LANG': 'en_US.UTF-8', 'TERM': 'linux', 'SHELL': '/bin/bash', 'XDG_SESSION_COOKIE': '9ca12473fbb1d023794ffd180000023c-1464192605.912671-1195279248', 'MAIL': '/var/mail/cltbld', 'SHLVL': '1', 'TMOUT': '86400', 'NODE_PATH': '/usr/lib/nodejs:/usr/lib/node_modules:/usr/share/javascript', 'PWD': '/builds/slave/test', 'LOGNAME': 'cltbld', 'USER': 'cltbld', 'PROPERTIES_FILE': '/builds/slave/test/buildprops.json', 'PATH': '/usr/local/bin:/usr/local/bin:/usr/bin:/bin:/usr/local/games:/usr/games', 'HOME': '/home/cltbld', 'DISPLAY': ':0', '_': '/tools/buildbot/bin/python'}}, attempt #1 10:15:38 INFO - Running command: ['/builds/slave/test/build/venv/bin/pip', 'install', '--timeout', '120', '--no-index', '--find-links', 'http://pypi.pvt.build.mozilla.org.proxxy1.srv.releng.use1.mozilla.com/pub', '--find-links', 'http://pypi.pub.build.mozilla.org.proxxy1.srv.releng.use1.mozilla.com/pub', '--find-links', 'http://pypi.pvt.build.mozilla.org/pub', '--find-links', 'http://pypi.pub.build.mozilla.org/pub', 'mock'] in /builds/slave/test/build 10:15:38 INFO - Copy/paste: /builds/slave/test/build/venv/bin/pip install --timeout 120 --no-index --find-links http://pypi.pvt.build.mozilla.org.proxxy1.srv.releng.use1.mozilla.com/pub --find-links http://pypi.pub.build.mozilla.org.proxxy1.srv.releng.use1.mozilla.com/pub --find-links http://pypi.pvt.build.mozilla.org/pub --find-links http://pypi.pub.build.mozilla.org/pub mock 10:15:38 INFO - Using env: {'DISPLAY': ':0', 10:15:38 INFO - 'HOME': '/home/cltbld', 10:15:38 INFO - 'LANG': 'en_US.UTF-8', 10:15:38 INFO - 'LOGNAME': 'cltbld', 10:15:38 INFO - 'MAIL': '/var/mail/cltbld', 10:15:38 INFO - 'NODE_PATH': '/usr/lib/nodejs:/usr/lib/node_modules:/usr/share/javascript', 10:15:38 INFO - 'PATH': '/usr/local/bin:/usr/local/bin:/usr/bin:/bin:/usr/local/games:/usr/games', 10:15:38 INFO - 'PROPERTIES_FILE': '/builds/slave/test/buildprops.json', 10:15:38 INFO - 'PWD': '/builds/slave/test', 10:15:38 INFO - 'SHELL': '/bin/bash', 10:15:38 INFO - 'SHLVL': '1', 10:15:38 INFO - 'TERM': 'linux', 10:15:38 INFO - 'TMOUT': '86400', 10:15:38 INFO - 'USER': 'cltbld', 10:15:38 INFO - 'XDG_SESSION_COOKIE': '9ca12473fbb1d023794ffd180000023c-1464192605.912671-1195279248', 10:15:38 INFO - '_': '/tools/buildbot/bin/python'} 10:15:38 INFO - Ignoring indexes: https://pypi.python.org/simple/ 10:15:38 INFO - Downloading/unpacking mock 10:15:38 INFO - http://pypi.pvt.build.mozilla.org/pub uses an insecure transport scheme (http). Consider using https if pypi.pvt.build.mozilla.org has it available 10:15:38 INFO - http://pypi.pub.build.mozilla.org/pub uses an insecure transport scheme (http). Consider using https if pypi.pub.build.mozilla.org has it available 10:15:38 INFO - http://pypi.pvt.build.mozilla.org.proxxy1.srv.releng.use1.mozilla.com/pub uses an insecure transport scheme (http). Consider using https if pypi.pvt.build.mozilla.org.proxxy1.srv.releng.use1.mozilla.com has it available 10:15:38 INFO - http://pypi.pub.build.mozilla.org.proxxy1.srv.releng.use1.mozilla.com/pub uses an insecure transport scheme (http). Consider using https if pypi.pub.build.mozilla.org.proxxy1.srv.releng.use1.mozilla.com has it available 10:15:38 INFO - http://pypi.pvt.build.mozilla.org/pub uses an insecure transport scheme (http). Consider using https if pypi.pvt.build.mozilla.org has it available 10:15:38 INFO - http://pypi.pub.build.mozilla.org/pub uses an insecure transport scheme (http). Consider using https if pypi.pub.build.mozilla.org has it available 10:15:44 INFO - Running setup.py (path:/builds/slave/test/build/venv/build/mock/setup.py) egg_info for package mock 10:15:44 INFO - warning: no files found matching '*.png' under directory 'docs' 10:15:44 INFO - warning: no files found matching '*.css' under directory 'docs' 10:15:44 INFO - warning: no files found matching '*.html' under directory 'docs' 10:15:44 INFO - warning: no files found matching '*.js' under directory 'docs' 10:15:44 INFO - Installing collected packages: mock 10:15:44 INFO - Running setup.py install for mock 10:15:44 INFO - warning: no files found matching '*.png' under directory 'docs' 10:15:44 INFO - warning: no files found matching '*.css' under directory 'docs' 10:15:44 INFO - warning: no files found matching '*.html' under directory 'docs' 10:15:44 INFO - warning: no files found matching '*.js' under directory 'docs' 10:15:44 INFO - Successfully installed mock 10:15:44 INFO - Cleaning up... 10:15:45 INFO - Return code: 0 10:15:45 INFO - Installing simplejson into virtualenv /builds/slave/test/build/venv 10:15:45 INFO - proxxy config: {'regions': ['.use1.', '.usw2.', '.scl3'], 'instances': ['proxxy1.srv.releng.use1.mozilla.com', 'proxxy1.srv.releng.usw2.mozilla.com', 'proxxy1.srv.releng.scl3.mozilla.com'], 'urls': [('http://ftp.mozilla.org', 'ftp.mozilla.org'), ('https://ftp.mozilla.org', 'ftp.mozilla.org'), ('https://ftp-ssl.mozilla.org', 'ftp.mozilla.org'), ('http://pvtbuilds.pvt.build.mozilla.org', 'pvtbuilds.mozilla.org'), ('http://pypi.pvt.build.mozilla.org', 'pypi.pvt.build.mozilla.org'), ('http://pypi.pub.build.mozilla.org', 'pypi.pub.build.mozilla.org'), ('https://queue.taskcluster.net', 'queue.taskcluster.net')]} 10:15:45 INFO - http://pypi.pvt.build.mozilla.org/pub matches http://pypi.pvt.build.mozilla.org 10:15:45 INFO - URL Candidate: http://pypi.pvt.build.mozilla.org.proxxy1.srv.releng.use1.mozilla.com/pub 10:15:45 INFO - proxxy config: {'regions': ['.use1.', '.usw2.', '.scl3'], 'instances': ['proxxy1.srv.releng.use1.mozilla.com', 'proxxy1.srv.releng.usw2.mozilla.com', 'proxxy1.srv.releng.scl3.mozilla.com'], 'urls': [('http://ftp.mozilla.org', 'ftp.mozilla.org'), ('https://ftp.mozilla.org', 'ftp.mozilla.org'), ('https://ftp-ssl.mozilla.org', 'ftp.mozilla.org'), ('http://pvtbuilds.pvt.build.mozilla.org', 'pvtbuilds.mozilla.org'), ('http://pypi.pvt.build.mozilla.org', 'pypi.pvt.build.mozilla.org'), ('http://pypi.pub.build.mozilla.org', 'pypi.pub.build.mozilla.org'), ('https://queue.taskcluster.net', 'queue.taskcluster.net')]} 10:15:45 INFO - http://pypi.pub.build.mozilla.org/pub matches http://pypi.pub.build.mozilla.org 10:15:45 INFO - URL Candidate: http://pypi.pub.build.mozilla.org.proxxy1.srv.releng.use1.mozilla.com/pub 10:15:45 INFO - retry: Calling run_command with args: [['/builds/slave/test/build/venv/bin/pip', 'install', '--timeout', '120', '--no-index', '--find-links', 'http://pypi.pvt.build.mozilla.org.proxxy1.srv.releng.use1.mozilla.com/pub', '--find-links', 'http://pypi.pub.build.mozilla.org.proxxy1.srv.releng.use1.mozilla.com/pub', '--find-links', 'http://pypi.pvt.build.mozilla.org/pub', '--find-links', 'http://pypi.pub.build.mozilla.org/pub', 'simplejson']], kwargs: {'error_level': 'warning', 'error_list': [{'substr': 'not found or a compiler error:', 'level': 'warning'}, {'regex': <_sre.SRE_Pattern object at 0xbaa1f0>, 'level': 'error'}, {'regex': <_sre.SRE_Pattern object at 0x7fd9095bee40>, 'level': 'warning'}, {'regex': <_sre.SRE_Pattern object at 0xcaff50>, 'level': 'debug'}, {'substr': 'command not found', 'level': 'error'}, {'regex': <_sre.SRE_Pattern object at 0xcac600>, 'level': 'warning'}, {'substr': 'Traceback (most recent call last)', 'level': 'error'}, {'substr': 'SyntaxError: ', 'level': 'error'}, {'substr': 'TypeError: ', 'level': 'error'}, {'substr': 'NameError: ', 'level': 'error'}, {'substr': 'ZeroDivisionError: ', 'level': 'error'}, {'regex': <_sre.SRE_Pattern object at 0xcadf60>, 'level': 'critical'}, {'regex': <_sre.SRE_Pattern object at 0xcae1e0>, 'level': 'critical'}], 'cwd': '/builds/slave/test/build', 'env': {'LANG': 'en_US.UTF-8', 'TERM': 'linux', 'SHELL': '/bin/bash', 'XDG_SESSION_COOKIE': '9ca12473fbb1d023794ffd180000023c-1464192605.912671-1195279248', 'MAIL': '/var/mail/cltbld', 'SHLVL': '1', 'TMOUT': '86400', 'NODE_PATH': '/usr/lib/nodejs:/usr/lib/node_modules:/usr/share/javascript', 'PWD': '/builds/slave/test', 'LOGNAME': 'cltbld', 'USER': 'cltbld', 'PROPERTIES_FILE': '/builds/slave/test/buildprops.json', 'PATH': '/usr/local/bin:/usr/local/bin:/usr/bin:/bin:/usr/local/games:/usr/games', 'HOME': '/home/cltbld', 'DISPLAY': ':0', '_': '/tools/buildbot/bin/python'}}, attempt #1 10:15:45 INFO - Running command: ['/builds/slave/test/build/venv/bin/pip', 'install', '--timeout', '120', '--no-index', '--find-links', 'http://pypi.pvt.build.mozilla.org.proxxy1.srv.releng.use1.mozilla.com/pub', '--find-links', 'http://pypi.pub.build.mozilla.org.proxxy1.srv.releng.use1.mozilla.com/pub', '--find-links', 'http://pypi.pvt.build.mozilla.org/pub', '--find-links', 'http://pypi.pub.build.mozilla.org/pub', 'simplejson'] in /builds/slave/test/build 10:15:45 INFO - Copy/paste: /builds/slave/test/build/venv/bin/pip install --timeout 120 --no-index --find-links http://pypi.pvt.build.mozilla.org.proxxy1.srv.releng.use1.mozilla.com/pub --find-links http://pypi.pub.build.mozilla.org.proxxy1.srv.releng.use1.mozilla.com/pub --find-links http://pypi.pvt.build.mozilla.org/pub --find-links http://pypi.pub.build.mozilla.org/pub simplejson 10:15:45 INFO - Using env: {'DISPLAY': ':0', 10:15:45 INFO - 'HOME': '/home/cltbld', 10:15:45 INFO - 'LANG': 'en_US.UTF-8', 10:15:45 INFO - 'LOGNAME': 'cltbld', 10:15:45 INFO - 'MAIL': '/var/mail/cltbld', 10:15:45 INFO - 'NODE_PATH': '/usr/lib/nodejs:/usr/lib/node_modules:/usr/share/javascript', 10:15:45 INFO - 'PATH': '/usr/local/bin:/usr/local/bin:/usr/bin:/bin:/usr/local/games:/usr/games', 10:15:45 INFO - 'PROPERTIES_FILE': '/builds/slave/test/buildprops.json', 10:15:45 INFO - 'PWD': '/builds/slave/test', 10:15:45 INFO - 'SHELL': '/bin/bash', 10:15:45 INFO - 'SHLVL': '1', 10:15:45 INFO - 'TERM': 'linux', 10:15:45 INFO - 'TMOUT': '86400', 10:15:45 INFO - 'USER': 'cltbld', 10:15:45 INFO - 'XDG_SESSION_COOKIE': '9ca12473fbb1d023794ffd180000023c-1464192605.912671-1195279248', 10:15:45 INFO - '_': '/tools/buildbot/bin/python'} 10:15:45 INFO - Ignoring indexes: https://pypi.python.org/simple/ 10:15:45 INFO - Downloading/unpacking simplejson 10:15:45 INFO - http://pypi.pvt.build.mozilla.org/pub uses an insecure transport scheme (http). Consider using https if pypi.pvt.build.mozilla.org has it available 10:15:45 INFO - http://pypi.pub.build.mozilla.org/pub uses an insecure transport scheme (http). Consider using https if pypi.pub.build.mozilla.org has it available 10:15:45 INFO - http://pypi.pvt.build.mozilla.org.proxxy1.srv.releng.use1.mozilla.com/pub uses an insecure transport scheme (http). Consider using https if pypi.pvt.build.mozilla.org.proxxy1.srv.releng.use1.mozilla.com has it available 10:15:45 INFO - http://pypi.pub.build.mozilla.org.proxxy1.srv.releng.use1.mozilla.com/pub uses an insecure transport scheme (http). Consider using https if pypi.pub.build.mozilla.org.proxxy1.srv.releng.use1.mozilla.com has it available 10:15:45 INFO - http://pypi.pvt.build.mozilla.org/pub uses an insecure transport scheme (http). Consider using https if pypi.pvt.build.mozilla.org has it available 10:15:45 INFO - http://pypi.pub.build.mozilla.org/pub uses an insecure transport scheme (http). Consider using https if pypi.pub.build.mozilla.org has it available 10:15:50 INFO - Running setup.py (path:/builds/slave/test/build/venv/build/simplejson/setup.py) egg_info for package simplejson 10:15:50 INFO - Installing collected packages: simplejson 10:15:50 INFO - Running setup.py install for simplejson 10:15:51 INFO - building 'simplejson._speedups' extension 10:15:51 INFO - gcc -pthread -fno-strict-aliasing -DNDEBUG -g -fwrapv -O2 -Wall -Wstrict-prototypes -fPIC -I/usr/include/python2.7 -c simplejson/_speedups.c -o build/temp.linux-x86_64-2.7/simplejson/_speedups.o 10:15:52 INFO - gcc -pthread -shared -Wl,-O1 -Wl,-Bsymbolic-functions -Wl,-Bsymbolic-functions -Wl,-z,relro build/temp.linux-x86_64-2.7/simplejson/_speedups.o -o build/lib.linux-x86_64-2.7/simplejson/_speedups.so 10:15:52 INFO - Successfully installed simplejson 10:15:52 INFO - Cleaning up... 10:15:52 INFO - Return code: 0 10:15:52 INFO - Installing None into virtualenv /builds/slave/test/build/venv 10:15:52 INFO - proxxy config: {'regions': ['.use1.', '.usw2.', '.scl3'], 'instances': ['proxxy1.srv.releng.use1.mozilla.com', 'proxxy1.srv.releng.usw2.mozilla.com', 'proxxy1.srv.releng.scl3.mozilla.com'], 'urls': [('http://ftp.mozilla.org', 'ftp.mozilla.org'), ('https://ftp.mozilla.org', 'ftp.mozilla.org'), ('https://ftp-ssl.mozilla.org', 'ftp.mozilla.org'), ('http://pvtbuilds.pvt.build.mozilla.org', 'pvtbuilds.mozilla.org'), ('http://pypi.pvt.build.mozilla.org', 'pypi.pvt.build.mozilla.org'), ('http://pypi.pub.build.mozilla.org', 'pypi.pub.build.mozilla.org'), ('https://queue.taskcluster.net', 'queue.taskcluster.net')]} 10:15:52 INFO - http://pypi.pvt.build.mozilla.org/pub matches http://pypi.pvt.build.mozilla.org 10:15:52 INFO - URL Candidate: http://pypi.pvt.build.mozilla.org.proxxy1.srv.releng.use1.mozilla.com/pub 10:15:52 INFO - proxxy config: {'regions': ['.use1.', '.usw2.', '.scl3'], 'instances': ['proxxy1.srv.releng.use1.mozilla.com', 'proxxy1.srv.releng.usw2.mozilla.com', 'proxxy1.srv.releng.scl3.mozilla.com'], 'urls': [('http://ftp.mozilla.org', 'ftp.mozilla.org'), ('https://ftp.mozilla.org', 'ftp.mozilla.org'), ('https://ftp-ssl.mozilla.org', 'ftp.mozilla.org'), ('http://pvtbuilds.pvt.build.mozilla.org', 'pvtbuilds.mozilla.org'), ('http://pypi.pvt.build.mozilla.org', 'pypi.pvt.build.mozilla.org'), ('http://pypi.pub.build.mozilla.org', 'pypi.pub.build.mozilla.org'), ('https://queue.taskcluster.net', 'queue.taskcluster.net')]} 10:15:52 INFO - http://pypi.pub.build.mozilla.org/pub matches http://pypi.pub.build.mozilla.org 10:15:52 INFO - URL Candidate: http://pypi.pub.build.mozilla.org.proxxy1.srv.releng.use1.mozilla.com/pub 10:15:52 INFO - retry: Calling run_command with args: [['/builds/slave/test/build/venv/bin/pip', 'install', '--no-deps', '--timeout', '120', '-r', '/builds/slave/test/build/tests/config/marionette_requirements.txt', '--no-index', '--find-links', 'http://pypi.pvt.build.mozilla.org.proxxy1.srv.releng.use1.mozilla.com/pub', '--find-links', 'http://pypi.pub.build.mozilla.org.proxxy1.srv.releng.use1.mozilla.com/pub', '--find-links', 'http://pypi.pvt.build.mozilla.org/pub', '--find-links', 'http://pypi.pub.build.mozilla.org/pub']], kwargs: {'error_level': 'warning', 'error_list': [{'substr': 'not found or a compiler error:', 'level': 'warning'}, {'regex': <_sre.SRE_Pattern object at 0xbaa1f0>, 'level': 'error'}, {'regex': <_sre.SRE_Pattern object at 0x7fd9095bee40>, 'level': 'warning'}, {'regex': <_sre.SRE_Pattern object at 0xcaff50>, 'level': 'debug'}, {'substr': 'command not found', 'level': 'error'}, {'regex': <_sre.SRE_Pattern object at 0xcac600>, 'level': 'warning'}, {'substr': 'Traceback (most recent call last)', 'level': 'error'}, {'substr': 'SyntaxError: ', 'level': 'error'}, {'substr': 'TypeError: ', 'level': 'error'}, {'substr': 'NameError: ', 'level': 'error'}, {'substr': 'ZeroDivisionError: ', 'level': 'error'}, {'regex': <_sre.SRE_Pattern object at 0xcadf60>, 'level': 'critical'}, {'regex': <_sre.SRE_Pattern object at 0xcae1e0>, 'level': 'critical'}], 'cwd': '/builds/slave/test/build/tests/config', 'env': {'LANG': 'en_US.UTF-8', 'TERM': 'linux', 'SHELL': '/bin/bash', 'XDG_SESSION_COOKIE': '9ca12473fbb1d023794ffd180000023c-1464192605.912671-1195279248', 'MAIL': '/var/mail/cltbld', 'SHLVL': '1', 'TMOUT': '86400', 'NODE_PATH': '/usr/lib/nodejs:/usr/lib/node_modules:/usr/share/javascript', 'PWD': '/builds/slave/test', 'LOGNAME': 'cltbld', 'USER': 'cltbld', 'PROPERTIES_FILE': '/builds/slave/test/buildprops.json', 'PATH': '/usr/local/bin:/usr/local/bin:/usr/bin:/bin:/usr/local/games:/usr/games', 'HOME': '/home/cltbld', 'DISPLAY': ':0', '_': '/tools/buildbot/bin/python'}}, attempt #1 10:15:52 INFO - Running command: ['/builds/slave/test/build/venv/bin/pip', 'install', '--no-deps', '--timeout', '120', '-r', '/builds/slave/test/build/tests/config/marionette_requirements.txt', '--no-index', '--find-links', 'http://pypi.pvt.build.mozilla.org.proxxy1.srv.releng.use1.mozilla.com/pub', '--find-links', 'http://pypi.pub.build.mozilla.org.proxxy1.srv.releng.use1.mozilla.com/pub', '--find-links', 'http://pypi.pvt.build.mozilla.org/pub', '--find-links', 'http://pypi.pub.build.mozilla.org/pub'] in /builds/slave/test/build/tests/config 10:15:52 INFO - Copy/paste: /builds/slave/test/build/venv/bin/pip install --no-deps --timeout 120 -r /builds/slave/test/build/tests/config/marionette_requirements.txt --no-index --find-links http://pypi.pvt.build.mozilla.org.proxxy1.srv.releng.use1.mozilla.com/pub --find-links http://pypi.pub.build.mozilla.org.proxxy1.srv.releng.use1.mozilla.com/pub --find-links http://pypi.pvt.build.mozilla.org/pub --find-links http://pypi.pub.build.mozilla.org/pub 10:15:52 INFO - Using env: {'DISPLAY': ':0', 10:15:52 INFO - 'HOME': '/home/cltbld', 10:15:52 INFO - 'LANG': 'en_US.UTF-8', 10:15:52 INFO - 'LOGNAME': 'cltbld', 10:15:52 INFO - 'MAIL': '/var/mail/cltbld', 10:15:52 INFO - 'NODE_PATH': '/usr/lib/nodejs:/usr/lib/node_modules:/usr/share/javascript', 10:15:52 INFO - 'PATH': '/usr/local/bin:/usr/local/bin:/usr/bin:/bin:/usr/local/games:/usr/games', 10:15:52 INFO - 'PROPERTIES_FILE': '/builds/slave/test/buildprops.json', 10:15:52 INFO - 'PWD': '/builds/slave/test', 10:15:52 INFO - 'SHELL': '/bin/bash', 10:15:52 INFO - 'SHLVL': '1', 10:15:52 INFO - 'TERM': 'linux', 10:15:52 INFO - 'TMOUT': '86400', 10:15:52 INFO - 'USER': 'cltbld', 10:15:52 INFO - 'XDG_SESSION_COOKIE': '9ca12473fbb1d023794ffd180000023c-1464192605.912671-1195279248', 10:15:52 INFO - '_': '/tools/buildbot/bin/python'} 10:15:53 INFO - Ignoring indexes: https://pypi.python.org/simple/ 10:15:53 INFO - Unpacking /builds/slave/test/build/tests/mozbase/manifestparser 10:15:53 INFO - Running setup.py (path:/tmp/pip-w7nHpS-build/setup.py) egg_info for package from file:///builds/slave/test/build/tests/mozbase/manifestparser 10:15:53 INFO - Requirement already satisfied (use --upgrade to upgrade): manifestparser==1.1 from file:///builds/slave/test/build/tests/mozbase/manifestparser in /builds/slave/test/build/venv/lib/python2.7/site-packages (from -r /builds/slave/test/build/tests/config/mozbase_requirements.txt (line 1)) 10:15:53 INFO - Unpacking /builds/slave/test/build/tests/mozbase/mozcrash 10:15:53 INFO - Running setup.py (path:/tmp/pip-EERQZ5-build/setup.py) egg_info for package from file:///builds/slave/test/build/tests/mozbase/mozcrash 10:15:53 INFO - Requirement already satisfied (use --upgrade to upgrade): mozcrash==0.17 from file:///builds/slave/test/build/tests/mozbase/mozcrash in /builds/slave/test/build/venv/lib/python2.7/site-packages (from -r /builds/slave/test/build/tests/config/mozbase_requirements.txt (line 2)) 10:15:53 INFO - Unpacking /builds/slave/test/build/tests/mozbase/mozdebug 10:15:53 INFO - Running setup.py (path:/tmp/pip-WCMSuN-build/setup.py) egg_info for package from file:///builds/slave/test/build/tests/mozbase/mozdebug 10:15:53 INFO - Requirement already satisfied (use --upgrade to upgrade): mozdebug==0.1 from file:///builds/slave/test/build/tests/mozbase/mozdebug in /builds/slave/test/build/venv/lib/python2.7/site-packages (from -r /builds/slave/test/build/tests/config/mozbase_requirements.txt (line 3)) 10:15:53 INFO - Unpacking /builds/slave/test/build/tests/mozbase/mozdevice 10:15:53 INFO - Running setup.py (path:/tmp/pip-9Uqh1T-build/setup.py) egg_info for package from file:///builds/slave/test/build/tests/mozbase/mozdevice 10:15:53 INFO - Requirement already satisfied (use --upgrade to upgrade): mozdevice==0.48 from file:///builds/slave/test/build/tests/mozbase/mozdevice in /builds/slave/test/build/venv/lib/python2.7/site-packages (from -r /builds/slave/test/build/tests/config/mozbase_requirements.txt (line 4)) 10:15:53 INFO - Unpacking /builds/slave/test/build/tests/mozbase/mozfile 10:15:53 INFO - Running setup.py (path:/tmp/pip-yZt9lm-build/setup.py) egg_info for package from file:///builds/slave/test/build/tests/mozbase/mozfile 10:15:54 INFO - Requirement already satisfied (use --upgrade to upgrade): mozfile==1.2 from file:///builds/slave/test/build/tests/mozbase/mozfile in /builds/slave/test/build/venv/lib/python2.7/site-packages (from -r /builds/slave/test/build/tests/config/mozbase_requirements.txt (line 5)) 10:15:54 INFO - Unpacking /builds/slave/test/build/tests/mozbase/mozhttpd 10:15:54 INFO - Running setup.py (path:/tmp/pip-G0JGG0-build/setup.py) egg_info for package from file:///builds/slave/test/build/tests/mozbase/mozhttpd 10:15:54 INFO - Requirement already satisfied (use --upgrade to upgrade): mozhttpd==0.7 from file:///builds/slave/test/build/tests/mozbase/mozhttpd in /builds/slave/test/build/venv/lib/python2.7/site-packages (from -r /builds/slave/test/build/tests/config/mozbase_requirements.txt (line 6)) 10:15:54 INFO - Unpacking /builds/slave/test/build/tests/mozbase/mozinfo 10:15:54 INFO - Running setup.py (path:/tmp/pip-_xDr3m-build/setup.py) egg_info for package from file:///builds/slave/test/build/tests/mozbase/mozinfo 10:15:54 INFO - Requirement already satisfied (use --upgrade to upgrade): mozinfo==0.9 from file:///builds/slave/test/build/tests/mozbase/mozinfo in /builds/slave/test/build/venv/lib/python2.7/site-packages (from -r /builds/slave/test/build/tests/config/mozbase_requirements.txt (line 7)) 10:15:54 INFO - Unpacking /builds/slave/test/build/tests/mozbase/mozinstall 10:15:54 INFO - Running setup.py (path:/tmp/pip-won_xy-build/setup.py) egg_info for package from file:///builds/slave/test/build/tests/mozbase/mozinstall 10:15:54 INFO - Requirement already satisfied (use --upgrade to upgrade): mozInstall==1.12 from file:///builds/slave/test/build/tests/mozbase/mozinstall in /builds/slave/test/build/venv/lib/python2.7/site-packages (from -r /builds/slave/test/build/tests/config/mozbase_requirements.txt (line 8)) 10:15:54 INFO - Unpacking /builds/slave/test/build/tests/mozbase/mozleak 10:15:54 INFO - Running setup.py (path:/tmp/pip-svCg0l-build/setup.py) egg_info for package from file:///builds/slave/test/build/tests/mozbase/mozleak 10:15:54 INFO - Requirement already satisfied (use --upgrade to upgrade): mozleak==0.1 from file:///builds/slave/test/build/tests/mozbase/mozleak in /builds/slave/test/build/venv/lib/python2.7/site-packages (from -r /builds/slave/test/build/tests/config/mozbase_requirements.txt (line 9)) 10:15:54 INFO - Unpacking /builds/slave/test/build/tests/mozbase/mozlog 10:15:54 INFO - Running setup.py (path:/tmp/pip-5l9VuA-build/setup.py) egg_info for package from file:///builds/slave/test/build/tests/mozbase/mozlog 10:15:54 INFO - Requirement already satisfied (use --upgrade to upgrade): mozlog==3.2 from file:///builds/slave/test/build/tests/mozbase/mozlog in /builds/slave/test/build/venv/lib/python2.7/site-packages (from -r /builds/slave/test/build/tests/config/mozbase_requirements.txt (line 10)) 10:15:54 INFO - Unpacking /builds/slave/test/build/tests/mozbase/moznetwork 10:15:54 INFO - Running setup.py (path:/tmp/pip-lMBlMw-build/setup.py) egg_info for package from file:///builds/slave/test/build/tests/mozbase/moznetwork 10:15:54 INFO - Requirement already satisfied (use --upgrade to upgrade): moznetwork==0.27 from file:///builds/slave/test/build/tests/mozbase/moznetwork in /builds/slave/test/build/venv/lib/python2.7/site-packages (from -r /builds/slave/test/build/tests/config/mozbase_requirements.txt (line 11)) 10:15:54 INFO - Unpacking /builds/slave/test/build/tests/mozbase/mozprocess 10:15:54 INFO - Running setup.py (path:/tmp/pip-yNFS_Y-build/setup.py) egg_info for package from file:///builds/slave/test/build/tests/mozbase/mozprocess 10:15:55 INFO - Requirement already satisfied (use --upgrade to upgrade): mozprocess==0.22 from file:///builds/slave/test/build/tests/mozbase/mozprocess in /builds/slave/test/build/venv/lib/python2.7/site-packages (from -r /builds/slave/test/build/tests/config/mozbase_requirements.txt (line 12)) 10:15:55 INFO - Unpacking /builds/slave/test/build/tests/mozbase/mozprofile 10:15:55 INFO - Running setup.py (path:/tmp/pip-fNF7Dq-build/setup.py) egg_info for package from file:///builds/slave/test/build/tests/mozbase/mozprofile 10:15:55 INFO - Requirement already satisfied (use --upgrade to upgrade): mozprofile==0.28 from file:///builds/slave/test/build/tests/mozbase/mozprofile in /builds/slave/test/build/venv/lib/python2.7/site-packages (from -r /builds/slave/test/build/tests/config/mozbase_requirements.txt (line 13)) 10:15:55 INFO - Unpacking /builds/slave/test/build/tests/mozbase/mozrunner 10:15:55 INFO - Running setup.py (path:/tmp/pip-IumiHX-build/setup.py) egg_info for package from file:///builds/slave/test/build/tests/mozbase/mozrunner 10:15:55 INFO - Requirement already satisfied (use --upgrade to upgrade): mozrunner==6.11 from file:///builds/slave/test/build/tests/mozbase/mozrunner in /builds/slave/test/build/venv/lib/python2.7/site-packages (from -r /builds/slave/test/build/tests/config/mozbase_requirements.txt (line 14)) 10:15:55 INFO - Unpacking /builds/slave/test/build/tests/mozbase/mozscreenshot 10:15:55 INFO - Running setup.py (path:/tmp/pip-huIyCl-build/setup.py) egg_info for package from file:///builds/slave/test/build/tests/mozbase/mozscreenshot 10:15:55 INFO - Requirement already satisfied (use --upgrade to upgrade): mozscreenshot==0.1 from file:///builds/slave/test/build/tests/mozbase/mozscreenshot in /builds/slave/test/build/venv/lib/python2.7/site-packages (from -r /builds/slave/test/build/tests/config/mozbase_requirements.txt (line 15)) 10:15:55 INFO - Unpacking /builds/slave/test/build/tests/mozbase/moztest 10:15:55 INFO - Running setup.py (path:/tmp/pip-in9pG6-build/setup.py) egg_info for package from file:///builds/slave/test/build/tests/mozbase/moztest 10:15:55 INFO - Requirement already satisfied (use --upgrade to upgrade): moztest==0.7 from file:///builds/slave/test/build/tests/mozbase/moztest in /builds/slave/test/build/venv/lib/python2.7/site-packages (from -r /builds/slave/test/build/tests/config/mozbase_requirements.txt (line 16)) 10:15:55 INFO - Unpacking /builds/slave/test/build/tests/mozbase/mozversion 10:15:55 INFO - Running setup.py (path:/tmp/pip-7VMwX2-build/setup.py) egg_info for package from file:///builds/slave/test/build/tests/mozbase/mozversion 10:15:55 INFO - Requirement already satisfied (use --upgrade to upgrade): mozversion==1.4 from file:///builds/slave/test/build/tests/mozbase/mozversion in /builds/slave/test/build/venv/lib/python2.7/site-packages (from -r /builds/slave/test/build/tests/config/mozbase_requirements.txt (line 17)) 10:15:55 INFO - Unpacking /builds/slave/test/build/tests/tools/wptserve 10:15:55 INFO - Running setup.py (path:/tmp/pip-2WOHFs-build/setup.py) egg_info for package from file:///builds/slave/test/build/tests/tools/wptserve 10:15:55 INFO - Unpacking /builds/slave/test/build/tests/marionette/client 10:15:55 INFO - Running setup.py (path:/tmp/pip-u3cGS_-build/setup.py) egg_info for package from file:///builds/slave/test/build/tests/marionette/client 10:15:56 INFO - Unpacking /builds/slave/test/build/tests/marionette/marionette/runner/mixins/browsermob-proxy-py 10:15:56 INFO - Running setup.py (path:/tmp/pip-h53agx-build/setup.py) egg_info for package from file:///builds/slave/test/build/tests/marionette/marionette/runner/mixins/browsermob-proxy-py 10:15:56 INFO - Unpacking /builds/slave/test/build/tests/marionette 10:15:56 INFO - Running setup.py (path:/tmp/pip-Kmzms2-build/setup.py) egg_info for package from file:///builds/slave/test/build/tests/marionette 10:15:56 INFO - warning: no files found matching '*.js' under directory 'marionette/touch' 10:15:56 INFO - Installing collected packages: wptserve, marionette-driver, browsermob-proxy, marionette-client 10:15:56 INFO - Running setup.py install for wptserve 10:15:57 INFO - Running setup.py install for marionette-driver 10:15:57 INFO - Running setup.py install for browsermob-proxy 10:15:57 INFO - Running setup.py install for marionette-client 10:15:57 INFO - warning: no files found matching '*.js' under directory 'marionette/touch' 10:15:58 INFO - Installing marionette script to /builds/slave/test/build/venv/bin 10:15:58 INFO - Successfully installed wptserve marionette-driver browsermob-proxy marionette-client 10:15:58 INFO - Cleaning up... 10:15:58 INFO - Return code: 0 10:15:58 INFO - Installing None into virtualenv /builds/slave/test/build/venv 10:15:58 INFO - proxxy config: {'regions': ['.use1.', '.usw2.', '.scl3'], 'instances': ['proxxy1.srv.releng.use1.mozilla.com', 'proxxy1.srv.releng.usw2.mozilla.com', 'proxxy1.srv.releng.scl3.mozilla.com'], 'urls': [('http://ftp.mozilla.org', 'ftp.mozilla.org'), ('https://ftp.mozilla.org', 'ftp.mozilla.org'), ('https://ftp-ssl.mozilla.org', 'ftp.mozilla.org'), ('http://pvtbuilds.pvt.build.mozilla.org', 'pvtbuilds.mozilla.org'), ('http://pypi.pvt.build.mozilla.org', 'pypi.pvt.build.mozilla.org'), ('http://pypi.pub.build.mozilla.org', 'pypi.pub.build.mozilla.org'), ('https://queue.taskcluster.net', 'queue.taskcluster.net')]} 10:15:58 INFO - http://pypi.pvt.build.mozilla.org/pub matches http://pypi.pvt.build.mozilla.org 10:15:58 INFO - URL Candidate: http://pypi.pvt.build.mozilla.org.proxxy1.srv.releng.use1.mozilla.com/pub 10:15:58 INFO - proxxy config: {'regions': ['.use1.', '.usw2.', '.scl3'], 'instances': ['proxxy1.srv.releng.use1.mozilla.com', 'proxxy1.srv.releng.usw2.mozilla.com', 'proxxy1.srv.releng.scl3.mozilla.com'], 'urls': [('http://ftp.mozilla.org', 'ftp.mozilla.org'), ('https://ftp.mozilla.org', 'ftp.mozilla.org'), ('https://ftp-ssl.mozilla.org', 'ftp.mozilla.org'), ('http://pvtbuilds.pvt.build.mozilla.org', 'pvtbuilds.mozilla.org'), ('http://pypi.pvt.build.mozilla.org', 'pypi.pvt.build.mozilla.org'), ('http://pypi.pub.build.mozilla.org', 'pypi.pub.build.mozilla.org'), ('https://queue.taskcluster.net', 'queue.taskcluster.net')]} 10:15:58 INFO - http://pypi.pub.build.mozilla.org/pub matches http://pypi.pub.build.mozilla.org 10:15:58 INFO - URL Candidate: http://pypi.pub.build.mozilla.org.proxxy1.srv.releng.use1.mozilla.com/pub 10:15:58 INFO - retry: Calling run_command with args: [['/builds/slave/test/build/venv/bin/pip', 'install', '--timeout', '120', '-r', '/builds/slave/test/build/tests/config/marionette_requirements.txt', '--no-index', '--find-links', 'http://pypi.pvt.build.mozilla.org.proxxy1.srv.releng.use1.mozilla.com/pub', '--find-links', 'http://pypi.pub.build.mozilla.org.proxxy1.srv.releng.use1.mozilla.com/pub', '--find-links', 'http://pypi.pvt.build.mozilla.org/pub', '--find-links', 'http://pypi.pub.build.mozilla.org/pub']], kwargs: {'error_level': 'warning', 'error_list': [{'substr': 'not found or a compiler error:', 'level': 'warning'}, {'regex': <_sre.SRE_Pattern object at 0xbaa1f0>, 'level': 'error'}, {'regex': <_sre.SRE_Pattern object at 0x7fd9095bee40>, 'level': 'warning'}, {'regex': <_sre.SRE_Pattern object at 0xcaff50>, 'level': 'debug'}, {'substr': 'command not found', 'level': 'error'}, {'regex': <_sre.SRE_Pattern object at 0xcac600>, 'level': 'warning'}, {'substr': 'Traceback (most recent call last)', 'level': 'error'}, {'substr': 'SyntaxError: ', 'level': 'error'}, {'substr': 'TypeError: ', 'level': 'error'}, {'substr': 'NameError: ', 'level': 'error'}, {'substr': 'ZeroDivisionError: ', 'level': 'error'}, {'regex': <_sre.SRE_Pattern object at 0xcadf60>, 'level': 'critical'}, {'regex': <_sre.SRE_Pattern object at 0xcae1e0>, 'level': 'critical'}], 'cwd': '/builds/slave/test/build/tests/config', 'env': {'LANG': 'en_US.UTF-8', 'TERM': 'linux', 'SHELL': '/bin/bash', 'XDG_SESSION_COOKIE': '9ca12473fbb1d023794ffd180000023c-1464192605.912671-1195279248', 'MAIL': '/var/mail/cltbld', 'SHLVL': '1', 'TMOUT': '86400', 'NODE_PATH': '/usr/lib/nodejs:/usr/lib/node_modules:/usr/share/javascript', 'PWD': '/builds/slave/test', 'LOGNAME': 'cltbld', 'USER': 'cltbld', 'PROPERTIES_FILE': '/builds/slave/test/buildprops.json', 'PATH': '/usr/local/bin:/usr/local/bin:/usr/bin:/bin:/usr/local/games:/usr/games', 'HOME': '/home/cltbld', 'DISPLAY': ':0', '_': '/tools/buildbot/bin/python'}}, attempt #1 10:15:58 INFO - Running command: ['/builds/slave/test/build/venv/bin/pip', 'install', '--timeout', '120', '-r', '/builds/slave/test/build/tests/config/marionette_requirements.txt', '--no-index', '--find-links', 'http://pypi.pvt.build.mozilla.org.proxxy1.srv.releng.use1.mozilla.com/pub', '--find-links', 'http://pypi.pub.build.mozilla.org.proxxy1.srv.releng.use1.mozilla.com/pub', '--find-links', 'http://pypi.pvt.build.mozilla.org/pub', '--find-links', 'http://pypi.pub.build.mozilla.org/pub'] in /builds/slave/test/build/tests/config 10:15:58 INFO - Copy/paste: /builds/slave/test/build/venv/bin/pip install --timeout 120 -r /builds/slave/test/build/tests/config/marionette_requirements.txt --no-index --find-links http://pypi.pvt.build.mozilla.org.proxxy1.srv.releng.use1.mozilla.com/pub --find-links http://pypi.pub.build.mozilla.org.proxxy1.srv.releng.use1.mozilla.com/pub --find-links http://pypi.pvt.build.mozilla.org/pub --find-links http://pypi.pub.build.mozilla.org/pub 10:15:58 INFO - Using env: {'DISPLAY': ':0', 10:15:58 INFO - 'HOME': '/home/cltbld', 10:15:58 INFO - 'LANG': 'en_US.UTF-8', 10:15:58 INFO - 'LOGNAME': 'cltbld', 10:15:58 INFO - 'MAIL': '/var/mail/cltbld', 10:15:58 INFO - 'NODE_PATH': '/usr/lib/nodejs:/usr/lib/node_modules:/usr/share/javascript', 10:15:58 INFO - 'PATH': '/usr/local/bin:/usr/local/bin:/usr/bin:/bin:/usr/local/games:/usr/games', 10:15:58 INFO - 'PROPERTIES_FILE': '/builds/slave/test/buildprops.json', 10:15:58 INFO - 'PWD': '/builds/slave/test', 10:15:58 INFO - 'SHELL': '/bin/bash', 10:15:58 INFO - 'SHLVL': '1', 10:15:58 INFO - 'TERM': 'linux', 10:15:58 INFO - 'TMOUT': '86400', 10:15:58 INFO - 'USER': 'cltbld', 10:15:58 INFO - 'XDG_SESSION_COOKIE': '9ca12473fbb1d023794ffd180000023c-1464192605.912671-1195279248', 10:15:58 INFO - '_': '/tools/buildbot/bin/python'} 10:15:58 INFO - Ignoring indexes: https://pypi.python.org/simple/ 10:15:58 INFO - Unpacking /builds/slave/test/build/tests/mozbase/manifestparser 10:15:58 INFO - Running setup.py (path:/tmp/pip-bkCbVJ-build/setup.py) egg_info for package from file:///builds/slave/test/build/tests/mozbase/manifestparser 10:15:58 INFO - Requirement already satisfied (use --upgrade to upgrade): manifestparser==1.1 from file:///builds/slave/test/build/tests/mozbase/manifestparser in /builds/slave/test/build/venv/lib/python2.7/site-packages (from -r /builds/slave/test/build/tests/config/mozbase_requirements.txt (line 1)) 10:15:58 INFO - Unpacking /builds/slave/test/build/tests/mozbase/mozcrash 10:15:58 INFO - Running setup.py (path:/tmp/pip-kFBYwt-build/setup.py) egg_info for package from file:///builds/slave/test/build/tests/mozbase/mozcrash 10:15:59 INFO - Requirement already satisfied (use --upgrade to upgrade): mozcrash==0.17 from file:///builds/slave/test/build/tests/mozbase/mozcrash in /builds/slave/test/build/venv/lib/python2.7/site-packages (from -r /builds/slave/test/build/tests/config/mozbase_requirements.txt (line 2)) 10:15:59 INFO - Unpacking /builds/slave/test/build/tests/mozbase/mozdebug 10:15:59 INFO - Running setup.py (path:/tmp/pip-7Bsz8e-build/setup.py) egg_info for package from file:///builds/slave/test/build/tests/mozbase/mozdebug 10:15:59 INFO - Requirement already satisfied (use --upgrade to upgrade): mozdebug==0.1 from file:///builds/slave/test/build/tests/mozbase/mozdebug in /builds/slave/test/build/venv/lib/python2.7/site-packages (from -r /builds/slave/test/build/tests/config/mozbase_requirements.txt (line 3)) 10:15:59 INFO - Unpacking /builds/slave/test/build/tests/mozbase/mozdevice 10:15:59 INFO - Running setup.py (path:/tmp/pip-0x3h8W-build/setup.py) egg_info for package from file:///builds/slave/test/build/tests/mozbase/mozdevice 10:15:59 INFO - Requirement already satisfied (use --upgrade to upgrade): mozdevice==0.48 from file:///builds/slave/test/build/tests/mozbase/mozdevice in /builds/slave/test/build/venv/lib/python2.7/site-packages (from -r /builds/slave/test/build/tests/config/mozbase_requirements.txt (line 4)) 10:15:59 INFO - Unpacking /builds/slave/test/build/tests/mozbase/mozfile 10:15:59 INFO - Running setup.py (path:/tmp/pip-vlTK69-build/setup.py) egg_info for package from file:///builds/slave/test/build/tests/mozbase/mozfile 10:15:59 INFO - Requirement already satisfied (use --upgrade to upgrade): mozfile==1.2 from file:///builds/slave/test/build/tests/mozbase/mozfile in /builds/slave/test/build/venv/lib/python2.7/site-packages (from -r /builds/slave/test/build/tests/config/mozbase_requirements.txt (line 5)) 10:15:59 INFO - Unpacking /builds/slave/test/build/tests/mozbase/mozhttpd 10:15:59 INFO - Running setup.py (path:/tmp/pip-wwakyf-build/setup.py) egg_info for package from file:///builds/slave/test/build/tests/mozbase/mozhttpd 10:15:59 INFO - Requirement already satisfied (use --upgrade to upgrade): mozhttpd==0.7 from file:///builds/slave/test/build/tests/mozbase/mozhttpd in /builds/slave/test/build/venv/lib/python2.7/site-packages (from -r /builds/slave/test/build/tests/config/mozbase_requirements.txt (line 6)) 10:15:59 INFO - Unpacking /builds/slave/test/build/tests/mozbase/mozinfo 10:15:59 INFO - Running setup.py (path:/tmp/pip-lnKnXG-build/setup.py) egg_info for package from file:///builds/slave/test/build/tests/mozbase/mozinfo 10:15:59 INFO - Requirement already satisfied (use --upgrade to upgrade): mozinfo==0.9 from file:///builds/slave/test/build/tests/mozbase/mozinfo in /builds/slave/test/build/venv/lib/python2.7/site-packages (from -r /builds/slave/test/build/tests/config/mozbase_requirements.txt (line 7)) 10:15:59 INFO - Unpacking /builds/slave/test/build/tests/mozbase/mozinstall 10:15:59 INFO - Running setup.py (path:/tmp/pip-_01_Hi-build/setup.py) egg_info for package from file:///builds/slave/test/build/tests/mozbase/mozinstall 10:16:00 INFO - Requirement already satisfied (use --upgrade to upgrade): mozInstall==1.12 from file:///builds/slave/test/build/tests/mozbase/mozinstall in /builds/slave/test/build/venv/lib/python2.7/site-packages (from -r /builds/slave/test/build/tests/config/mozbase_requirements.txt (line 8)) 10:16:00 INFO - Unpacking /builds/slave/test/build/tests/mozbase/mozleak 10:16:00 INFO - Running setup.py (path:/tmp/pip-xlzuGp-build/setup.py) egg_info for package from file:///builds/slave/test/build/tests/mozbase/mozleak 10:16:00 INFO - Requirement already satisfied (use --upgrade to upgrade): mozleak==0.1 from file:///builds/slave/test/build/tests/mozbase/mozleak in /builds/slave/test/build/venv/lib/python2.7/site-packages (from -r /builds/slave/test/build/tests/config/mozbase_requirements.txt (line 9)) 10:16:00 INFO - Unpacking /builds/slave/test/build/tests/mozbase/mozlog 10:16:00 INFO - Running setup.py (path:/tmp/pip-9ckKUL-build/setup.py) egg_info for package from file:///builds/slave/test/build/tests/mozbase/mozlog 10:16:00 INFO - Requirement already satisfied (use --upgrade to upgrade): mozlog==3.2 from file:///builds/slave/test/build/tests/mozbase/mozlog in /builds/slave/test/build/venv/lib/python2.7/site-packages (from -r /builds/slave/test/build/tests/config/mozbase_requirements.txt (line 10)) 10:16:00 INFO - Unpacking /builds/slave/test/build/tests/mozbase/moznetwork 10:16:00 INFO - Running setup.py (path:/tmp/pip-8LgkN5-build/setup.py) egg_info for package from file:///builds/slave/test/build/tests/mozbase/moznetwork 10:16:00 INFO - Requirement already satisfied (use --upgrade to upgrade): moznetwork==0.27 from file:///builds/slave/test/build/tests/mozbase/moznetwork in /builds/slave/test/build/venv/lib/python2.7/site-packages (from -r /builds/slave/test/build/tests/config/mozbase_requirements.txt (line 11)) 10:16:00 INFO - Unpacking /builds/slave/test/build/tests/mozbase/mozprocess 10:16:00 INFO - Running setup.py (path:/tmp/pip-a1DgKo-build/setup.py) egg_info for package from file:///builds/slave/test/build/tests/mozbase/mozprocess 10:16:00 INFO - Requirement already satisfied (use --upgrade to upgrade): mozprocess==0.22 from file:///builds/slave/test/build/tests/mozbase/mozprocess in /builds/slave/test/build/venv/lib/python2.7/site-packages (from -r /builds/slave/test/build/tests/config/mozbase_requirements.txt (line 12)) 10:16:00 INFO - Unpacking /builds/slave/test/build/tests/mozbase/mozprofile 10:16:00 INFO - Running setup.py (path:/tmp/pip-YlOJ0h-build/setup.py) egg_info for package from file:///builds/slave/test/build/tests/mozbase/mozprofile 10:16:00 INFO - Requirement already satisfied (use --upgrade to upgrade): mozprofile==0.28 from file:///builds/slave/test/build/tests/mozbase/mozprofile in /builds/slave/test/build/venv/lib/python2.7/site-packages (from -r /builds/slave/test/build/tests/config/mozbase_requirements.txt (line 13)) 10:16:00 INFO - Unpacking /builds/slave/test/build/tests/mozbase/mozrunner 10:16:00 INFO - Running setup.py (path:/tmp/pip-fbLlQ8-build/setup.py) egg_info for package from file:///builds/slave/test/build/tests/mozbase/mozrunner 10:16:01 INFO - Requirement already satisfied (use --upgrade to upgrade): mozrunner==6.11 from file:///builds/slave/test/build/tests/mozbase/mozrunner in /builds/slave/test/build/venv/lib/python2.7/site-packages (from -r /builds/slave/test/build/tests/config/mozbase_requirements.txt (line 14)) 10:16:01 INFO - Unpacking /builds/slave/test/build/tests/mozbase/mozscreenshot 10:16:01 INFO - Running setup.py (path:/tmp/pip-QV5fxp-build/setup.py) egg_info for package from file:///builds/slave/test/build/tests/mozbase/mozscreenshot 10:16:01 INFO - Requirement already satisfied (use --upgrade to upgrade): mozscreenshot==0.1 from file:///builds/slave/test/build/tests/mozbase/mozscreenshot in /builds/slave/test/build/venv/lib/python2.7/site-packages (from -r /builds/slave/test/build/tests/config/mozbase_requirements.txt (line 15)) 10:16:01 INFO - Unpacking /builds/slave/test/build/tests/mozbase/moztest 10:16:01 INFO - Running setup.py (path:/tmp/pip-tulTDb-build/setup.py) egg_info for package from file:///builds/slave/test/build/tests/mozbase/moztest 10:16:01 INFO - Requirement already satisfied (use --upgrade to upgrade): moztest==0.7 from file:///builds/slave/test/build/tests/mozbase/moztest in /builds/slave/test/build/venv/lib/python2.7/site-packages (from -r /builds/slave/test/build/tests/config/mozbase_requirements.txt (line 16)) 10:16:01 INFO - Unpacking /builds/slave/test/build/tests/mozbase/mozversion 10:16:01 INFO - Running setup.py (path:/tmp/pip-XuTMqM-build/setup.py) egg_info for package from file:///builds/slave/test/build/tests/mozbase/mozversion 10:16:01 INFO - Requirement already satisfied (use --upgrade to upgrade): mozversion==1.4 from file:///builds/slave/test/build/tests/mozbase/mozversion in /builds/slave/test/build/venv/lib/python2.7/site-packages (from -r /builds/slave/test/build/tests/config/mozbase_requirements.txt (line 17)) 10:16:01 INFO - Unpacking /builds/slave/test/build/tests/tools/wptserve 10:16:01 INFO - Running setup.py (path:/tmp/pip-71H8gt-build/setup.py) egg_info for package from file:///builds/slave/test/build/tests/tools/wptserve 10:16:01 INFO - Requirement already satisfied (use --upgrade to upgrade): wptserve==1.4.0 from file:///builds/slave/test/build/tests/tools/wptserve in /builds/slave/test/build/venv/lib/python2.7/site-packages (from -r /builds/slave/test/build/tests/config/marionette_requirements.txt (line 2)) 10:16:01 INFO - Unpacking /builds/slave/test/build/tests/marionette/client 10:16:01 INFO - Running setup.py (path:/tmp/pip-MDJaX2-build/setup.py) egg_info for package from file:///builds/slave/test/build/tests/marionette/client 10:16:01 INFO - Requirement already satisfied (use --upgrade to upgrade): marionette-driver==1.4.0 from file:///builds/slave/test/build/tests/marionette/client in /builds/slave/test/build/venv/lib/python2.7/site-packages (from -r /builds/slave/test/build/tests/config/marionette_requirements.txt (line 3)) 10:16:01 INFO - Unpacking /builds/slave/test/build/tests/marionette/marionette/runner/mixins/browsermob-proxy-py 10:16:01 INFO - Running setup.py (path:/tmp/pip-yIJ469-build/setup.py) egg_info for package from file:///builds/slave/test/build/tests/marionette/marionette/runner/mixins/browsermob-proxy-py 10:16:01 INFO - Requirement already satisfied (use --upgrade to upgrade): browsermob-proxy==0.6.0 from file:///builds/slave/test/build/tests/marionette/marionette/runner/mixins/browsermob-proxy-py in /builds/slave/test/build/venv/lib/python2.7/site-packages (from -r /builds/slave/test/build/tests/config/marionette_requirements.txt (line 4)) 10:16:01 INFO - Unpacking /builds/slave/test/build/tests/marionette 10:16:02 INFO - Running setup.py (path:/tmp/pip-9Ddpja-build/setup.py) egg_info for package from file:///builds/slave/test/build/tests/marionette 10:16:02 INFO - warning: no files found matching '*.js' under directory 'marionette/touch' 10:16:02 INFO - Requirement already satisfied (use --upgrade to upgrade): marionette-client==2.3.0 from file:///builds/slave/test/build/tests/marionette in /builds/slave/test/build/venv/lib/python2.7/site-packages (from -r /builds/slave/test/build/tests/config/marionette_requirements.txt (line 5)) 10:16:02 INFO - Requirement already satisfied (use --upgrade to upgrade): mozfile>=1.0 in /builds/slave/test/build/venv/lib/python2.7/site-packages (from mozcrash==0.17->-r /builds/slave/test/build/tests/config/mozbase_requirements.txt (line 2)) 10:16:02 INFO - Requirement already satisfied (use --upgrade to upgrade): mozlog>=3.0 in /builds/slave/test/build/venv/lib/python2.7/site-packages (from mozcrash==0.17->-r /builds/slave/test/build/tests/config/mozbase_requirements.txt (line 2)) 10:16:02 INFO - Requirement already satisfied (use --upgrade to upgrade): mozinfo in /builds/slave/test/build/venv/lib/python2.7/site-packages (from mozdebug==0.1->-r /builds/slave/test/build/tests/config/mozbase_requirements.txt (line 3)) 10:16:02 INFO - Requirement already satisfied (use --upgrade to upgrade): moznetwork>=0.24 in /builds/slave/test/build/venv/lib/python2.7/site-packages (from mozdevice==0.48->-r /builds/slave/test/build/tests/config/mozbase_requirements.txt (line 4)) 10:16:02 INFO - Requirement already satisfied (use --upgrade to upgrade): mozprocess>=0.19 in /builds/slave/test/build/venv/lib/python2.7/site-packages (from mozdevice==0.48->-r /builds/slave/test/build/tests/config/mozbase_requirements.txt (line 4)) 10:16:02 INFO - Requirement already satisfied (use --upgrade to upgrade): blessings>=1.3 in /builds/slave/test/build/venv/lib/python2.7/site-packages (from mozlog==3.2->-r /builds/slave/test/build/tests/config/mozbase_requirements.txt (line 10)) 10:16:02 INFO - Requirement already satisfied (use --upgrade to upgrade): requests>=1.1.0 in /builds/slave/test/build/venv/lib/python2.7/site-packages (from browsermob-proxy==0.6.0->-r /builds/slave/test/build/tests/config/marionette_requirements.txt (line 4)) 10:16:02 INFO - Cleaning up... 10:16:02 INFO - Return code: 0 10:16:02 INFO - Installing None into virtualenv /builds/slave/test/build/venv 10:16:02 INFO - proxxy config: {'regions': ['.use1.', '.usw2.', '.scl3'], 'instances': ['proxxy1.srv.releng.use1.mozilla.com', 'proxxy1.srv.releng.usw2.mozilla.com', 'proxxy1.srv.releng.scl3.mozilla.com'], 'urls': [('http://ftp.mozilla.org', 'ftp.mozilla.org'), ('https://ftp.mozilla.org', 'ftp.mozilla.org'), ('https://ftp-ssl.mozilla.org', 'ftp.mozilla.org'), ('http://pvtbuilds.pvt.build.mozilla.org', 'pvtbuilds.mozilla.org'), ('http://pypi.pvt.build.mozilla.org', 'pypi.pvt.build.mozilla.org'), ('http://pypi.pub.build.mozilla.org', 'pypi.pub.build.mozilla.org'), ('https://queue.taskcluster.net', 'queue.taskcluster.net')]} 10:16:02 INFO - http://pypi.pvt.build.mozilla.org/pub matches http://pypi.pvt.build.mozilla.org 10:16:02 INFO - URL Candidate: http://pypi.pvt.build.mozilla.org.proxxy1.srv.releng.use1.mozilla.com/pub 10:16:02 INFO - proxxy config: {'regions': ['.use1.', '.usw2.', '.scl3'], 'instances': ['proxxy1.srv.releng.use1.mozilla.com', 'proxxy1.srv.releng.usw2.mozilla.com', 'proxxy1.srv.releng.scl3.mozilla.com'], 'urls': [('http://ftp.mozilla.org', 'ftp.mozilla.org'), ('https://ftp.mozilla.org', 'ftp.mozilla.org'), ('https://ftp-ssl.mozilla.org', 'ftp.mozilla.org'), ('http://pvtbuilds.pvt.build.mozilla.org', 'pvtbuilds.mozilla.org'), ('http://pypi.pvt.build.mozilla.org', 'pypi.pvt.build.mozilla.org'), ('http://pypi.pub.build.mozilla.org', 'pypi.pub.build.mozilla.org'), ('https://queue.taskcluster.net', 'queue.taskcluster.net')]} 10:16:02 INFO - http://pypi.pub.build.mozilla.org/pub matches http://pypi.pub.build.mozilla.org 10:16:02 INFO - URL Candidate: http://pypi.pub.build.mozilla.org.proxxy1.srv.releng.use1.mozilla.com/pub 10:16:02 INFO - retry: Calling run_command with args: [['/builds/slave/test/build/venv/bin/pip', 'install', '--no-deps', '--timeout', '120', '-r', '/builds/slave/test/build/tests/mochitest/websocketprocessbridge/websocketprocessbridge_requirements.txt', '--no-index', '--find-links', 'http://pypi.pvt.build.mozilla.org.proxxy1.srv.releng.use1.mozilla.com/pub', '--find-links', 'http://pypi.pub.build.mozilla.org.proxxy1.srv.releng.use1.mozilla.com/pub', '--find-links', 'http://pypi.pvt.build.mozilla.org/pub', '--find-links', 'http://pypi.pub.build.mozilla.org/pub']], kwargs: {'error_level': 'warning', 'error_list': [{'substr': 'not found or a compiler error:', 'level': 'warning'}, {'regex': <_sre.SRE_Pattern object at 0xbaa1f0>, 'level': 'error'}, {'regex': <_sre.SRE_Pattern object at 0x7fd9095bee40>, 'level': 'warning'}, {'regex': <_sre.SRE_Pattern object at 0xcaff50>, 'level': 'debug'}, {'substr': 'command not found', 'level': 'error'}, {'regex': <_sre.SRE_Pattern object at 0xcac600>, 'level': 'warning'}, {'substr': 'Traceback (most recent call last)', 'level': 'error'}, {'substr': 'SyntaxError: ', 'level': 'error'}, {'substr': 'TypeError: ', 'level': 'error'}, {'substr': 'NameError: ', 'level': 'error'}, {'substr': 'ZeroDivisionError: ', 'level': 'error'}, {'regex': <_sre.SRE_Pattern object at 0xcadf60>, 'level': 'critical'}, {'regex': <_sre.SRE_Pattern object at 0xcae1e0>, 'level': 'critical'}], 'cwd': '/builds/slave/test/build/tests/mochitest/websocketprocessbridge', 'env': {'LANG': 'en_US.UTF-8', 'TERM': 'linux', 'SHELL': '/bin/bash', 'XDG_SESSION_COOKIE': '9ca12473fbb1d023794ffd180000023c-1464192605.912671-1195279248', 'MAIL': '/var/mail/cltbld', 'SHLVL': '1', 'TMOUT': '86400', 'NODE_PATH': '/usr/lib/nodejs:/usr/lib/node_modules:/usr/share/javascript', 'PWD': '/builds/slave/test', 'LOGNAME': 'cltbld', 'USER': 'cltbld', 'PROPERTIES_FILE': '/builds/slave/test/buildprops.json', 'PATH': '/usr/local/bin:/usr/local/bin:/usr/bin:/bin:/usr/local/games:/usr/games', 'HOME': '/home/cltbld', 'DISPLAY': ':0', '_': '/tools/buildbot/bin/python'}}, attempt #1 10:16:02 INFO - Running command: ['/builds/slave/test/build/venv/bin/pip', 'install', '--no-deps', '--timeout', '120', '-r', '/builds/slave/test/build/tests/mochitest/websocketprocessbridge/websocketprocessbridge_requirements.txt', '--no-index', '--find-links', 'http://pypi.pvt.build.mozilla.org.proxxy1.srv.releng.use1.mozilla.com/pub', '--find-links', 'http://pypi.pub.build.mozilla.org.proxxy1.srv.releng.use1.mozilla.com/pub', '--find-links', 'http://pypi.pvt.build.mozilla.org/pub', '--find-links', 'http://pypi.pub.build.mozilla.org/pub'] in /builds/slave/test/build/tests/mochitest/websocketprocessbridge 10:16:02 INFO - Copy/paste: /builds/slave/test/build/venv/bin/pip install --no-deps --timeout 120 -r /builds/slave/test/build/tests/mochitest/websocketprocessbridge/websocketprocessbridge_requirements.txt --no-index --find-links http://pypi.pvt.build.mozilla.org.proxxy1.srv.releng.use1.mozilla.com/pub --find-links http://pypi.pub.build.mozilla.org.proxxy1.srv.releng.use1.mozilla.com/pub --find-links http://pypi.pvt.build.mozilla.org/pub --find-links http://pypi.pub.build.mozilla.org/pub 10:16:02 INFO - Using env: {'DISPLAY': ':0', 10:16:02 INFO - 'HOME': '/home/cltbld', 10:16:02 INFO - 'LANG': 'en_US.UTF-8', 10:16:02 INFO - 'LOGNAME': 'cltbld', 10:16:02 INFO - 'MAIL': '/var/mail/cltbld', 10:16:02 INFO - 'NODE_PATH': '/usr/lib/nodejs:/usr/lib/node_modules:/usr/share/javascript', 10:16:02 INFO - 'PATH': '/usr/local/bin:/usr/local/bin:/usr/bin:/bin:/usr/local/games:/usr/games', 10:16:02 INFO - 'PROPERTIES_FILE': '/builds/slave/test/buildprops.json', 10:16:02 INFO - 'PWD': '/builds/slave/test', 10:16:02 INFO - 'SHELL': '/bin/bash', 10:16:02 INFO - 'SHLVL': '1', 10:16:02 INFO - 'TERM': 'linux', 10:16:02 INFO - 'TMOUT': '86400', 10:16:02 INFO - 'USER': 'cltbld', 10:16:02 INFO - 'XDG_SESSION_COOKIE': '9ca12473fbb1d023794ffd180000023c-1464192605.912671-1195279248', 10:16:02 INFO - '_': '/tools/buildbot/bin/python'} 10:16:03 INFO - Ignoring indexes: https://pypi.python.org/simple/ 10:16:03 INFO - Downloading/unpacking twisted==10.2.0 (from -r /builds/slave/test/build/tests/mochitest/websocketprocessbridge/websocketprocessbridge_requirements.txt (line 1)) 10:16:03 INFO - http://pypi.pvt.build.mozilla.org/pub uses an insecure transport scheme (http). Consider using https if pypi.pvt.build.mozilla.org has it available 10:16:03 INFO - http://pypi.pub.build.mozilla.org/pub uses an insecure transport scheme (http). Consider using https if pypi.pub.build.mozilla.org has it available 10:16:03 INFO - http://pypi.pvt.build.mozilla.org.proxxy1.srv.releng.use1.mozilla.com/pub uses an insecure transport scheme (http). Consider using https if pypi.pvt.build.mozilla.org.proxxy1.srv.releng.use1.mozilla.com has it available 10:16:03 INFO - http://pypi.pub.build.mozilla.org.proxxy1.srv.releng.use1.mozilla.com/pub uses an insecure transport scheme (http). Consider using https if pypi.pub.build.mozilla.org.proxxy1.srv.releng.use1.mozilla.com has it available 10:16:03 INFO - http://pypi.pvt.build.mozilla.org/pub uses an insecure transport scheme (http). Consider using https if pypi.pvt.build.mozilla.org has it available 10:16:03 INFO - http://pypi.pub.build.mozilla.org/pub uses an insecure transport scheme (http). Consider using https if pypi.pub.build.mozilla.org has it available 10:16:09 INFO - Running setup.py (path:/builds/slave/test/build/venv/build/twisted/setup.py) egg_info for package twisted 10:16:09 INFO - Downloading/unpacking txws==0.9.1 (from -r /builds/slave/test/build/tests/mochitest/websocketprocessbridge/websocketprocessbridge_requirements.txt (line 4)) 10:16:09 INFO - http://pypi.pvt.build.mozilla.org/pub uses an insecure transport scheme (http). Consider using https if pypi.pvt.build.mozilla.org has it available 10:16:09 INFO - http://pypi.pub.build.mozilla.org/pub uses an insecure transport scheme (http). Consider using https if pypi.pub.build.mozilla.org has it available 10:16:09 INFO - http://pypi.pvt.build.mozilla.org.proxxy1.srv.releng.use1.mozilla.com/pub uses an insecure transport scheme (http). Consider using https if pypi.pvt.build.mozilla.org.proxxy1.srv.releng.use1.mozilla.com has it available 10:16:09 INFO - http://pypi.pub.build.mozilla.org.proxxy1.srv.releng.use1.mozilla.com/pub uses an insecure transport scheme (http). Consider using https if pypi.pub.build.mozilla.org.proxxy1.srv.releng.use1.mozilla.com has it available 10:16:09 INFO - http://pypi.pvt.build.mozilla.org/pub uses an insecure transport scheme (http). Consider using https if pypi.pvt.build.mozilla.org has it available 10:16:09 INFO - http://pypi.pub.build.mozilla.org/pub uses an insecure transport scheme (http). Consider using https if pypi.pub.build.mozilla.org has it available 10:16:10 INFO - Downloading txWS-0.9.1.tar.gz 10:16:10 INFO - Running setup.py (path:/builds/slave/test/build/venv/build/txws/setup.py) egg_info for package txws 10:16:11 INFO - no previously-included directories found matching 'documentation/_build' 10:16:12 INFO - zip_safe flag not set; analyzing archive contents... 10:16:12 INFO - six: module references __path__ 10:16:12 INFO - Installed /builds/slave/test/build/venv/build/txws/six-1.10.0-py2.7.egg 10:16:12 INFO - Searching for vcversioner 10:16:12 INFO - Reading http://pypi.python.org/simple/vcversioner/ 10:16:12 INFO - Best match: vcversioner 2.16.0.0 10:16:12 INFO - Downloading https://pypi.python.org/packages/c5/cc/33162c0a7b28a4d8c83da07bc2b12cee58c120b4a9e8bba31c41c8d35a16/vcversioner-2.16.0.0.tar.gz#md5=aab6ef5e0cf8614a1b1140ed5b7f107d 10:16:13 INFO - Processing vcversioner-2.16.0.0.tar.gz 10:16:13 INFO - Running vcversioner-2.16.0.0/setup.py -q bdist_egg --dist-dir /tmp/easy_install-xQAnfm/vcversioner-2.16.0.0/egg-dist-tmp-PulKHd 10:16:13 INFO - zip_safe flag not set; analyzing archive contents... 10:16:13 INFO - Installed /builds/slave/test/build/venv/build/txws/vcversioner-2.16.0.0-py2.7.egg 10:16:13 INFO - Requirement already satisfied (use --upgrade to upgrade): psutil==3.1.1 in /builds/slave/test/build/venv/lib/python2.7/site-packages (from -r /builds/slave/test/build/tests/mochitest/websocketprocessbridge/websocketprocessbridge_requirements.txt (line 6)) 10:16:13 INFO - Downloading/unpacking six==1.10.0 (from -r /builds/slave/test/build/tests/mochitest/websocketprocessbridge/websocketprocessbridge_requirements.txt (line 9)) 10:16:13 INFO - http://pypi.pvt.build.mozilla.org/pub uses an insecure transport scheme (http). Consider using https if pypi.pvt.build.mozilla.org has it available 10:16:13 INFO - http://pypi.pub.build.mozilla.org/pub uses an insecure transport scheme (http). Consider using https if pypi.pub.build.mozilla.org has it available 10:16:13 INFO - http://pypi.pvt.build.mozilla.org.proxxy1.srv.releng.use1.mozilla.com/pub uses an insecure transport scheme (http). Consider using https if pypi.pvt.build.mozilla.org.proxxy1.srv.releng.use1.mozilla.com has it available 10:16:13 INFO - http://pypi.pub.build.mozilla.org.proxxy1.srv.releng.use1.mozilla.com/pub uses an insecure transport scheme (http). Consider using https if pypi.pub.build.mozilla.org.proxxy1.srv.releng.use1.mozilla.com has it available 10:16:13 INFO - http://pypi.pvt.build.mozilla.org/pub uses an insecure transport scheme (http). Consider using https if pypi.pvt.build.mozilla.org has it available 10:16:13 INFO - http://pypi.pub.build.mozilla.org/pub uses an insecure transport scheme (http). Consider using https if pypi.pub.build.mozilla.org has it available 10:16:13 INFO - Downloading six-1.10.0-py2.py3-none-any.whl 10:16:13 INFO - Downloading/unpacking ipaddr==2.1.11 (from -r /builds/slave/test/build/tests/mochitest/websocketprocessbridge/websocketprocessbridge_requirements.txt (line 12)) 10:16:13 INFO - http://pypi.pvt.build.mozilla.org/pub uses an insecure transport scheme (http). Consider using https if pypi.pvt.build.mozilla.org has it available 10:16:13 INFO - http://pypi.pub.build.mozilla.org/pub uses an insecure transport scheme (http). Consider using https if pypi.pub.build.mozilla.org has it available 10:16:13 INFO - http://pypi.pvt.build.mozilla.org.proxxy1.srv.releng.use1.mozilla.com/pub uses an insecure transport scheme (http). Consider using https if pypi.pvt.build.mozilla.org.proxxy1.srv.releng.use1.mozilla.com has it available 10:16:13 INFO - http://pypi.pub.build.mozilla.org.proxxy1.srv.releng.use1.mozilla.com/pub uses an insecure transport scheme (http). Consider using https if pypi.pub.build.mozilla.org.proxxy1.srv.releng.use1.mozilla.com has it available 10:16:13 INFO - http://pypi.pvt.build.mozilla.org/pub uses an insecure transport scheme (http). Consider using https if pypi.pvt.build.mozilla.org has it available 10:16:13 INFO - http://pypi.pub.build.mozilla.org/pub uses an insecure transport scheme (http). Consider using https if pypi.pub.build.mozilla.org has it available 10:16:14 INFO - Downloading ipaddr-2.1.11.tar.gz 10:16:14 INFO - Running setup.py (path:/builds/slave/test/build/venv/build/ipaddr/setup.py) egg_info for package ipaddr 10:16:14 INFO - Downloading/unpacking passlib==1.6.5 (from -r /builds/slave/test/build/tests/mochitest/websocketprocessbridge/websocketprocessbridge_requirements.txt (line 13)) 10:16:14 INFO - http://pypi.pvt.build.mozilla.org/pub uses an insecure transport scheme (http). Consider using https if pypi.pvt.build.mozilla.org has it available 10:16:14 INFO - http://pypi.pub.build.mozilla.org/pub uses an insecure transport scheme (http). Consider using https if pypi.pub.build.mozilla.org has it available 10:16:14 INFO - http://pypi.pvt.build.mozilla.org.proxxy1.srv.releng.use1.mozilla.com/pub uses an insecure transport scheme (http). Consider using https if pypi.pvt.build.mozilla.org.proxxy1.srv.releng.use1.mozilla.com has it available 10:16:14 INFO - http://pypi.pub.build.mozilla.org.proxxy1.srv.releng.use1.mozilla.com/pub uses an insecure transport scheme (http). Consider using https if pypi.pub.build.mozilla.org.proxxy1.srv.releng.use1.mozilla.com has it available 10:16:14 INFO - http://pypi.pvt.build.mozilla.org/pub uses an insecure transport scheme (http). Consider using https if pypi.pvt.build.mozilla.org has it available 10:16:14 INFO - http://pypi.pub.build.mozilla.org/pub uses an insecure transport scheme (http). Consider using https if pypi.pub.build.mozilla.org has it available 10:16:15 INFO - Installing collected packages: twisted, txws, six, ipaddr, passlib 10:16:15 INFO - Running setup.py install for twisted 10:16:16 INFO - changing mode of build/scripts-2.7/tap2rpm from 664 to 775 10:16:16 INFO - changing mode of build/scripts-2.7/tap2deb from 664 to 775 10:16:16 INFO - changing mode of build/scripts-2.7/manhole from 664 to 775 10:16:16 INFO - changing mode of build/scripts-2.7/pyhtmlizer from 664 to 775 10:16:16 INFO - changing mode of build/scripts-2.7/mktap from 664 to 775 10:16:16 INFO - changing mode of build/scripts-2.7/twistd from 664 to 775 10:16:16 INFO - changing mode of build/scripts-2.7/trial from 664 to 775 10:16:16 INFO - changing mode of build/scripts-2.7/tapconvert from 664 to 775 10:16:16 INFO - changing mode of build/scripts-2.7/mailmail from 664 to 775 10:16:16 INFO - changing mode of build/scripts-2.7/cftp from 664 to 775 10:16:16 INFO - changing mode of build/scripts-2.7/ckeygen from 664 to 775 10:16:16 INFO - changing mode of build/scripts-2.7/conch from 664 to 775 10:16:16 INFO - changing mode of build/scripts-2.7/tkconch from 664 to 775 10:16:16 INFO - changing mode of build/scripts-2.7/lore from 664 to 775 10:16:19 INFO - changing mode of /builds/slave/test/build/venv/bin/tap2rpm to 775 10:16:19 INFO - changing mode of /builds/slave/test/build/venv/bin/tap2deb to 775 10:16:19 INFO - changing mode of /builds/slave/test/build/venv/bin/manhole to 775 10:16:19 INFO - changing mode of /builds/slave/test/build/venv/bin/mailmail to 775 10:16:19 INFO - changing mode of /builds/slave/test/build/venv/bin/cftp to 775 10:16:19 INFO - changing mode of /builds/slave/test/build/venv/bin/pyhtmlizer to 775 10:16:19 INFO - changing mode of /builds/slave/test/build/venv/bin/mktap to 775 10:16:19 INFO - changing mode of /builds/slave/test/build/venv/bin/ckeygen to 775 10:16:19 INFO - changing mode of /builds/slave/test/build/venv/bin/twistd to 775 10:16:19 INFO - changing mode of /builds/slave/test/build/venv/bin/trial to 775 10:16:19 INFO - changing mode of /builds/slave/test/build/venv/bin/conch to 775 10:16:19 INFO - changing mode of /builds/slave/test/build/venv/bin/lore to 775 10:16:19 INFO - changing mode of /builds/slave/test/build/venv/bin/tkconch to 775 10:16:19 INFO - changing mode of /builds/slave/test/build/venv/bin/tapconvert to 775 10:16:19 INFO - Running setup.py install for txws 10:16:19 INFO - Running setup.py install for ipaddr 10:16:20 INFO - Successfully installed twisted txws six ipaddr passlib 10:16:20 INFO - Cleaning up... 10:16:20 INFO - Return code: 0 10:16:20 INFO - Installing None into virtualenv /builds/slave/test/build/venv 10:16:20 INFO - proxxy config: {'regions': ['.use1.', '.usw2.', '.scl3'], 'instances': ['proxxy1.srv.releng.use1.mozilla.com', 'proxxy1.srv.releng.usw2.mozilla.com', 'proxxy1.srv.releng.scl3.mozilla.com'], 'urls': [('http://ftp.mozilla.org', 'ftp.mozilla.org'), ('https://ftp.mozilla.org', 'ftp.mozilla.org'), ('https://ftp-ssl.mozilla.org', 'ftp.mozilla.org'), ('http://pvtbuilds.pvt.build.mozilla.org', 'pvtbuilds.mozilla.org'), ('http://pypi.pvt.build.mozilla.org', 'pypi.pvt.build.mozilla.org'), ('http://pypi.pub.build.mozilla.org', 'pypi.pub.build.mozilla.org'), ('https://queue.taskcluster.net', 'queue.taskcluster.net')]} 10:16:20 INFO - http://pypi.pvt.build.mozilla.org/pub matches http://pypi.pvt.build.mozilla.org 10:16:20 INFO - URL Candidate: http://pypi.pvt.build.mozilla.org.proxxy1.srv.releng.use1.mozilla.com/pub 10:16:20 INFO - proxxy config: {'regions': ['.use1.', '.usw2.', '.scl3'], 'instances': ['proxxy1.srv.releng.use1.mozilla.com', 'proxxy1.srv.releng.usw2.mozilla.com', 'proxxy1.srv.releng.scl3.mozilla.com'], 'urls': [('http://ftp.mozilla.org', 'ftp.mozilla.org'), ('https://ftp.mozilla.org', 'ftp.mozilla.org'), ('https://ftp-ssl.mozilla.org', 'ftp.mozilla.org'), ('http://pvtbuilds.pvt.build.mozilla.org', 'pvtbuilds.mozilla.org'), ('http://pypi.pvt.build.mozilla.org', 'pypi.pvt.build.mozilla.org'), ('http://pypi.pub.build.mozilla.org', 'pypi.pub.build.mozilla.org'), ('https://queue.taskcluster.net', 'queue.taskcluster.net')]} 10:16:20 INFO - http://pypi.pub.build.mozilla.org/pub matches http://pypi.pub.build.mozilla.org 10:16:20 INFO - URL Candidate: http://pypi.pub.build.mozilla.org.proxxy1.srv.releng.use1.mozilla.com/pub 10:16:20 INFO - retry: Calling run_command with args: [['/builds/slave/test/build/venv/bin/pip', 'install', '--timeout', '120', '-r', '/builds/slave/test/build/tests/mochitest/websocketprocessbridge/websocketprocessbridge_requirements.txt', '--no-index', '--find-links', 'http://pypi.pvt.build.mozilla.org.proxxy1.srv.releng.use1.mozilla.com/pub', '--find-links', 'http://pypi.pub.build.mozilla.org.proxxy1.srv.releng.use1.mozilla.com/pub', '--find-links', 'http://pypi.pvt.build.mozilla.org/pub', '--find-links', 'http://pypi.pub.build.mozilla.org/pub']], kwargs: {'error_level': 'warning', 'error_list': [{'substr': 'not found or a compiler error:', 'level': 'warning'}, {'regex': <_sre.SRE_Pattern object at 0xbaa1f0>, 'level': 'error'}, {'regex': <_sre.SRE_Pattern object at 0x7fd9095bee40>, 'level': 'warning'}, {'regex': <_sre.SRE_Pattern object at 0xcaff50>, 'level': 'debug'}, {'substr': 'command not found', 'level': 'error'}, {'regex': <_sre.SRE_Pattern object at 0xcac600>, 'level': 'warning'}, {'substr': 'Traceback (most recent call last)', 'level': 'error'}, {'substr': 'SyntaxError: ', 'level': 'error'}, {'substr': 'TypeError: ', 'level': 'error'}, {'substr': 'NameError: ', 'level': 'error'}, {'substr': 'ZeroDivisionError: ', 'level': 'error'}, {'regex': <_sre.SRE_Pattern object at 0xcadf60>, 'level': 'critical'}, {'regex': <_sre.SRE_Pattern object at 0xcae1e0>, 'level': 'critical'}], 'cwd': '/builds/slave/test/build/tests/mochitest/websocketprocessbridge', 'env': {'LANG': 'en_US.UTF-8', 'TERM': 'linux', 'SHELL': '/bin/bash', 'XDG_SESSION_COOKIE': '9ca12473fbb1d023794ffd180000023c-1464192605.912671-1195279248', 'MAIL': '/var/mail/cltbld', 'SHLVL': '1', 'TMOUT': '86400', 'NODE_PATH': '/usr/lib/nodejs:/usr/lib/node_modules:/usr/share/javascript', 'PWD': '/builds/slave/test', 'LOGNAME': 'cltbld', 'USER': 'cltbld', 'PROPERTIES_FILE': '/builds/slave/test/buildprops.json', 'PATH': '/usr/local/bin:/usr/local/bin:/usr/bin:/bin:/usr/local/games:/usr/games', 'HOME': '/home/cltbld', 'DISPLAY': ':0', '_': '/tools/buildbot/bin/python'}}, attempt #1 10:16:20 INFO - Running command: ['/builds/slave/test/build/venv/bin/pip', 'install', '--timeout', '120', '-r', '/builds/slave/test/build/tests/mochitest/websocketprocessbridge/websocketprocessbridge_requirements.txt', '--no-index', '--find-links', 'http://pypi.pvt.build.mozilla.org.proxxy1.srv.releng.use1.mozilla.com/pub', '--find-links', 'http://pypi.pub.build.mozilla.org.proxxy1.srv.releng.use1.mozilla.com/pub', '--find-links', 'http://pypi.pvt.build.mozilla.org/pub', '--find-links', 'http://pypi.pub.build.mozilla.org/pub'] in /builds/slave/test/build/tests/mochitest/websocketprocessbridge 10:16:20 INFO - Copy/paste: /builds/slave/test/build/venv/bin/pip install --timeout 120 -r /builds/slave/test/build/tests/mochitest/websocketprocessbridge/websocketprocessbridge_requirements.txt --no-index --find-links http://pypi.pvt.build.mozilla.org.proxxy1.srv.releng.use1.mozilla.com/pub --find-links http://pypi.pub.build.mozilla.org.proxxy1.srv.releng.use1.mozilla.com/pub --find-links http://pypi.pvt.build.mozilla.org/pub --find-links http://pypi.pub.build.mozilla.org/pub 10:16:20 INFO - Using env: {'DISPLAY': ':0', 10:16:20 INFO - 'HOME': '/home/cltbld', 10:16:20 INFO - 'LANG': 'en_US.UTF-8', 10:16:20 INFO - 'LOGNAME': 'cltbld', 10:16:20 INFO - 'MAIL': '/var/mail/cltbld', 10:16:20 INFO - 'NODE_PATH': '/usr/lib/nodejs:/usr/lib/node_modules:/usr/share/javascript', 10:16:20 INFO - 'PATH': '/usr/local/bin:/usr/local/bin:/usr/bin:/bin:/usr/local/games:/usr/games', 10:16:20 INFO - 'PROPERTIES_FILE': '/builds/slave/test/buildprops.json', 10:16:20 INFO - 'PWD': '/builds/slave/test', 10:16:20 INFO - 'SHELL': '/bin/bash', 10:16:20 INFO - 'SHLVL': '1', 10:16:20 INFO - 'TERM': 'linux', 10:16:20 INFO - 'TMOUT': '86400', 10:16:20 INFO - 'USER': 'cltbld', 10:16:20 INFO - 'XDG_SESSION_COOKIE': '9ca12473fbb1d023794ffd180000023c-1464192605.912671-1195279248', 10:16:20 INFO - '_': '/tools/buildbot/bin/python'} 10:16:20 INFO - Ignoring indexes: https://pypi.python.org/simple/ 10:16:20 INFO - Requirement already satisfied (use --upgrade to upgrade): twisted==10.2.0 in /builds/slave/test/build/venv/lib/python2.7/site-packages (from -r /builds/slave/test/build/tests/mochitest/websocketprocessbridge/websocketprocessbridge_requirements.txt (line 1)) 10:16:20 INFO - Requirement already satisfied (use --upgrade to upgrade): txws==0.9.1 in /builds/slave/test/build/venv/lib/python2.7/site-packages (from -r /builds/slave/test/build/tests/mochitest/websocketprocessbridge/websocketprocessbridge_requirements.txt (line 4)) 10:16:20 INFO - Requirement already satisfied (use --upgrade to upgrade): psutil==3.1.1 in /builds/slave/test/build/venv/lib/python2.7/site-packages (from -r /builds/slave/test/build/tests/mochitest/websocketprocessbridge/websocketprocessbridge_requirements.txt (line 6)) 10:16:20 INFO - Requirement already satisfied (use --upgrade to upgrade): six==1.10.0 in /builds/slave/test/build/venv/lib/python2.7/site-packages (from -r /builds/slave/test/build/tests/mochitest/websocketprocessbridge/websocketprocessbridge_requirements.txt (line 9)) 10:16:20 INFO - Requirement already satisfied (use --upgrade to upgrade): ipaddr==2.1.11 in /builds/slave/test/build/venv/lib/python2.7/site-packages (from -r /builds/slave/test/build/tests/mochitest/websocketprocessbridge/websocketprocessbridge_requirements.txt (line 12)) 10:16:20 INFO - Requirement already satisfied (use --upgrade to upgrade): passlib==1.6.5 in /builds/slave/test/build/venv/lib/python2.7/site-packages (from -r /builds/slave/test/build/tests/mochitest/websocketprocessbridge/websocketprocessbridge_requirements.txt (line 13)) 10:16:20 INFO - Downloading/unpacking zope.interface (from twisted==10.2.0->-r /builds/slave/test/build/tests/mochitest/websocketprocessbridge/websocketprocessbridge_requirements.txt (line 1)) 10:16:20 INFO - http://pypi.pvt.build.mozilla.org/pub uses an insecure transport scheme (http). Consider using https if pypi.pvt.build.mozilla.org has it available 10:16:20 INFO - http://pypi.pub.build.mozilla.org/pub uses an insecure transport scheme (http). Consider using https if pypi.pub.build.mozilla.org has it available 10:16:20 INFO - http://pypi.pvt.build.mozilla.org.proxxy1.srv.releng.use1.mozilla.com/pub uses an insecure transport scheme (http). Consider using https if pypi.pvt.build.mozilla.org.proxxy1.srv.releng.use1.mozilla.com has it available 10:16:20 INFO - http://pypi.pub.build.mozilla.org.proxxy1.srv.releng.use1.mozilla.com/pub uses an insecure transport scheme (http). Consider using https if pypi.pub.build.mozilla.org.proxxy1.srv.releng.use1.mozilla.com has it available 10:16:20 INFO - http://pypi.pvt.build.mozilla.org/pub uses an insecure transport scheme (http). Consider using https if pypi.pvt.build.mozilla.org has it available 10:16:20 INFO - http://pypi.pub.build.mozilla.org/pub uses an insecure transport scheme (http). Consider using https if pypi.pub.build.mozilla.org has it available 10:16:26 INFO - Running setup.py (path:/builds/slave/test/build/venv/build/zope.interface/setup.py) egg_info for package zope.interface 10:16:26 INFO - Downloading/unpacking setuptools (from zope.interface->twisted==10.2.0->-r /builds/slave/test/build/tests/mochitest/websocketprocessbridge/websocketprocessbridge_requirements.txt (line 1)) 10:16:26 INFO - http://pypi.pvt.build.mozilla.org/pub uses an insecure transport scheme (http). Consider using https if pypi.pvt.build.mozilla.org has it available 10:16:26 INFO - http://pypi.pub.build.mozilla.org/pub uses an insecure transport scheme (http). Consider using https if pypi.pub.build.mozilla.org has it available 10:16:26 INFO - http://pypi.pvt.build.mozilla.org.proxxy1.srv.releng.use1.mozilla.com/pub uses an insecure transport scheme (http). Consider using https if pypi.pvt.build.mozilla.org.proxxy1.srv.releng.use1.mozilla.com has it available 10:16:26 INFO - http://pypi.pub.build.mozilla.org.proxxy1.srv.releng.use1.mozilla.com/pub uses an insecure transport scheme (http). Consider using https if pypi.pub.build.mozilla.org.proxxy1.srv.releng.use1.mozilla.com has it available 10:16:26 INFO - http://pypi.pvt.build.mozilla.org/pub uses an insecure transport scheme (http). Consider using https if pypi.pvt.build.mozilla.org has it available 10:16:26 INFO - http://pypi.pub.build.mozilla.org/pub uses an insecure transport scheme (http). Consider using https if pypi.pub.build.mozilla.org has it available 10:16:27 INFO - Running setup.py (path:/builds/slave/test/build/venv/build/setuptools/setup.py) egg_info for package setuptools 10:16:28 INFO - Installing collected packages: zope.interface, setuptools 10:16:28 INFO - Running setup.py install for zope.interface 10:16:28 INFO - building 'zope.interface._zope_interface_coptimizations' extension 10:16:28 INFO - gcc -pthread -fno-strict-aliasing -DNDEBUG -g -fwrapv -O2 -Wall -Wstrict-prototypes -fPIC -I/usr/include/python2.7 -c src/zope/interface/_zope_interface_coptimizations.c -o build/temp.linux-x86_64-2.7/src/zope/interface/_zope_interface_coptimizations.o 10:16:29 INFO - gcc -pthread -shared -Wl,-O1 -Wl,-Bsymbolic-functions -Wl,-Bsymbolic-functions -Wl,-z,relro build/temp.linux-x86_64-2.7/src/zope/interface/_zope_interface_coptimizations.o -o build/lib.linux-x86_64-2.7/zope/interface/_zope_interface_coptimizations.so 10:16:29 INFO - Skipping installation of /builds/slave/test/build/venv/lib/python2.7/site-packages/zope/__init__.py (namespace package) 10:16:29 INFO - Installing /builds/slave/test/build/venv/lib/python2.7/site-packages/zope.interface-4.0.2-py2.7-nspkg.pth 10:16:29 INFO - Found existing installation: distribute 0.6.24 10:16:29 INFO - Uninstalling distribute: 10:16:29 INFO - Successfully uninstalled distribute 10:16:29 INFO - Running setup.py install for setuptools 10:16:29 INFO - Installing easy_install script to /builds/slave/test/build/venv/bin 10:16:29 INFO - Installing easy_install-2.7 script to /builds/slave/test/build/venv/bin 10:16:30 INFO - Successfully installed zope.interface setuptools 10:16:30 INFO - Cleaning up... 10:16:30 INFO - Return code: 0 10:16:30 INFO - Done creating virtualenv /builds/slave/test/build/venv. 10:16:30 INFO - Getting output from command: ['/builds/slave/test/build/venv/bin/pip', 'freeze'] 10:16:30 INFO - Copy/paste: /builds/slave/test/build/venv/bin/pip freeze 10:16:30 INFO - Reading from file tmpfile_stdout 10:16:30 INFO - Current package versions: 10:16:30 INFO - Twisted == 10.2.0 10:16:30 INFO - argparse == 1.2.1 10:16:30 INFO - blessings == 1.6 10:16:30 INFO - blobuploader == 1.2.4 10:16:30 INFO - browsermob-proxy == 0.6.0 10:16:30 INFO - docopt == 0.6.1 10:16:30 INFO - ipaddr == 2.1.11 10:16:30 INFO - manifestparser == 1.1 10:16:30 INFO - marionette-client == 2.3.0 10:16:30 INFO - marionette-driver == 1.4.0 10:16:30 INFO - mock == 1.0.1 10:16:30 INFO - mozInstall == 1.12 10:16:30 INFO - mozcrash == 0.17 10:16:30 INFO - mozdebug == 0.1 10:16:30 INFO - mozdevice == 0.48 10:16:30 INFO - mozfile == 1.2 10:16:30 INFO - mozhttpd == 0.7 10:16:30 INFO - mozinfo == 0.9 10:16:30 INFO - mozleak == 0.1 10:16:30 INFO - mozlog == 3.2 10:16:30 INFO - moznetwork == 0.27 10:16:30 INFO - mozprocess == 0.22 10:16:30 INFO - mozprofile == 0.28 10:16:30 INFO - mozrunner == 6.11 10:16:30 INFO - mozscreenshot == 0.1 10:16:30 INFO - mozsystemmonitor == 0.3 10:16:30 INFO - moztest == 0.7 10:16:30 INFO - mozversion == 1.4 10:16:30 INFO - passlib == 1.6.5 10:16:30 INFO - psutil == 3.1.1 10:16:30 INFO - requests == 1.2.3 10:16:30 INFO - simplejson == 3.3.0 10:16:30 INFO - six == 1.10.0 10:16:30 INFO - txWS == 0.9.1 10:16:30 INFO - wptserve == 1.4.0 10:16:30 INFO - wsgiref == 0.1.2 10:16:30 INFO - zope.interface == 4.0.2 10:16:30 INFO - Running post-action listener: _resource_record_post_action 10:16:30 INFO - Running post-action listener: _start_resource_monitoring 10:16:30 INFO - Starting resource monitoring. 10:16:30 INFO - ##### 10:16:30 INFO - ##### Finished create-virtualenv step (success) 10:16:30 INFO - ##### 10:16:30 INFO - ##### 10:16:30 INFO - ##### Running install step. 10:16:30 INFO - ##### 10:16:30 INFO - Running pre-action listener: _resource_record_pre_action 10:16:30 INFO - Running main action method: install 10:16:30 INFO - Getting output from command: ['/builds/slave/test/build/venv/bin/pip', 'freeze'] 10:16:30 INFO - Copy/paste: /builds/slave/test/build/venv/bin/pip freeze 10:16:31 INFO - Reading from file tmpfile_stdout 10:16:31 INFO - Detecting whether we're running mozinstall >=1.0... 10:16:31 INFO - Getting output from command: ['/builds/slave/test/build/venv/bin/mozinstall', '-h'] 10:16:31 INFO - Copy/paste: /builds/slave/test/build/venv/bin/mozinstall -h 10:16:31 INFO - Reading from file tmpfile_stdout 10:16:31 INFO - Output received: 10:16:31 INFO - Usage: mozinstall [options] installer 10:16:31 INFO - Options: 10:16:31 INFO - -h, --help show this help message and exit 10:16:31 INFO - -d DEST, --destination=DEST 10:16:31 INFO - Directory to install application into. [default: 10:16:31 INFO - "/builds/slave/test"] 10:16:31 INFO - --app=APP Application being installed. [default: firefox] 10:16:31 INFO - mkdir: /builds/slave/test/build/application 10:16:31 INFO - Getting output from command: ['/builds/slave/test/build/venv/bin/mozinstall', '/builds/slave/test/build/installer.tar.bz2', '--destination', '/builds/slave/test/build/application'] 10:16:31 INFO - Copy/paste: /builds/slave/test/build/venv/bin/mozinstall /builds/slave/test/build/installer.tar.bz2 --destination /builds/slave/test/build/application 10:18:02 INFO - Reading from file tmpfile_stdout 10:18:02 INFO - Output received: 10:18:02 INFO - /builds/slave/test/build/application/firefox/firefox 10:18:02 INFO - Running post-action listener: _resource_record_post_action 10:18:02 INFO - ##### 10:18:02 INFO - ##### Finished install step (success) 10:18:02 INFO - ##### 10:18:02 INFO - ##### 10:18:02 INFO - ##### Running run-tests step. 10:18:02 INFO - ##### 10:18:02 INFO - Running pre-action listener: _resource_record_pre_action 10:18:02 INFO - Running pre-action listener: _set_gcov_prefix 10:18:02 INFO - Running main action method: run_tests 10:18:02 INFO - Running pre test command disable_screen_saver with 'xset s off s reset' 10:18:02 INFO - Running command: ['xset', 's', 'off', 's', 'reset'] in /builds/slave/test/build 10:18:02 INFO - Copy/paste: xset s off s reset 10:18:02 INFO - Return code: 0 10:18:02 INFO - #### Running mochitest suites 10:18:02 INFO - finding symbols_url based upon self.installer_url 10:18:02 INFO - setting symbols_url as https://queue.taskcluster.net/v1/task/fO5lMFwzS6GfRd-U77rLDg/artifacts/public/build/firefox-49.0a1.en-US.linux-x86_64-asan.crashreporter-symbols.zip 10:18:02 INFO - grabbing minidump binary from tooltool 10:18:02 INFO - proxxy config: {'regions': ['.use1.', '.usw2.', '.scl3'], 'instances': ['proxxy1.srv.releng.use1.mozilla.com', 'proxxy1.srv.releng.usw2.mozilla.com', 'proxxy1.srv.releng.scl3.mozilla.com'], 'urls': [('http://ftp.mozilla.org', 'ftp.mozilla.org'), ('https://ftp.mozilla.org', 'ftp.mozilla.org'), ('https://ftp-ssl.mozilla.org', 'ftp.mozilla.org'), ('http://pvtbuilds.pvt.build.mozilla.org', 'pvtbuilds.mozilla.org'), ('http://pypi.pvt.build.mozilla.org', 'pypi.pvt.build.mozilla.org'), ('http://pypi.pub.build.mozilla.org', 'pypi.pub.build.mozilla.org'), ('https://queue.taskcluster.net', 'queue.taskcluster.net')]} 10:18:02 INFO - retry: Calling run_command with args: (['/tools/tooltool.py', '--url', 'https://api.pub.build.mozilla.org/tooltool/', '--authentication-file', '/builds/relengapi.tok', 'fetch', '-m', '/builds/slave/test/build/tests/config/tooltool-manifests/linux64/releng.manifest', '-o', '-c', '/builds/tooltool_cache'],), kwargs: {'output_timeout': 600, 'error_list': [{'substr': 'command not found', 'level': 'error'}, {'regex': <_sre.SRE_Pattern object at 0xcac600>, 'level': 'warning'}, {'substr': 'Traceback (most recent call last)', 'level': 'error'}, {'substr': 'SyntaxError: ', 'level': 'error'}, {'substr': 'TypeError: ', 'level': 'error'}, {'substr': 'NameError: ', 'level': 'error'}, {'substr': 'ZeroDivisionError: ', 'level': 'error'}, {'regex': <_sre.SRE_Pattern object at 0xcadf60>, 'level': 'critical'}, {'regex': <_sre.SRE_Pattern object at 0xcae1e0>, 'level': 'critical'}, {'substr': 'ERROR - ', 'level': 'error'}], 'cwd': '/builds/slave/test/build', 'privileged': False}, attempt #1 10:18:02 INFO - Running command: ['/tools/tooltool.py', '--url', 'https://api.pub.build.mozilla.org/tooltool/', '--authentication-file', '/builds/relengapi.tok', 'fetch', '-m', '/builds/slave/test/build/tests/config/tooltool-manifests/linux64/releng.manifest', '-o', '-c', '/builds/tooltool_cache'] in /builds/slave/test/build 10:18:02 INFO - Copy/paste: /tools/tooltool.py --url https://api.pub.build.mozilla.org/tooltool/ --authentication-file /builds/relengapi.tok fetch -m /builds/slave/test/build/tests/config/tooltool-manifests/linux64/releng.manifest -o -c /builds/tooltool_cache 10:18:02 INFO - Calling ['/tools/tooltool.py', '--url', 'https://api.pub.build.mozilla.org/tooltool/', '--authentication-file', '/builds/relengapi.tok', 'fetch', '-m', '/builds/slave/test/build/tests/config/tooltool-manifests/linux64/releng.manifest', '-o', '-c', '/builds/tooltool_cache'] with output_timeout 600 10:18:02 INFO - INFO - File linux64-minidump_stackwalk retrieved from local cache /builds/tooltool_cache 10:18:02 INFO - Return code: 0 10:18:02 INFO - Chmoding /builds/slave/test/build/linux64-minidump_stackwalk to 0755 10:18:02 INFO - mkdir: /builds/slave/test/build/blobber_upload_dir 10:18:02 INFO - ENV: MOZ_UPLOAD_DIR is now /builds/slave/test/build/blobber_upload_dir 10:18:02 INFO - ENV: MINIDUMP_STACKWALK is now /builds/slave/test/build/linux64-minidump_stackwalk 10:18:02 INFO - ENV: MINIDUMP_SAVE_PATH is now /builds/slave/test/build/blobber_upload_dir 10:18:02 INFO - Running command: ['/builds/slave/test/build/venv/bin/python', '-u', '/builds/slave/test/build/tests/mochitest/runtests.py', '--disable-e10s', '--appname=/builds/slave/test/build/application/firefox/firefox', '--utility-path=tests/bin', '--extra-profile-file=tests/bin/plugins', '--symbols-path=https://queue.taskcluster.net/v1/task/fO5lMFwzS6GfRd-U77rLDg/artifacts/public/build/firefox-49.0a1.en-US.linux-x86_64-asan.crashreporter-symbols.zip', '--certificate-path=tests/certs', '--setpref=webgl.force-enabled=true', '--quiet', '--log-raw=/builds/slave/test/build/blobber_upload_dir/chrome-clipboard_raw.log', '--log-errorsummary=/builds/slave/test/build/blobber_upload_dir/chrome-clipboard_errorsummary.log', '--use-test-media-devices', '--screenshot-on-fail', '--chrome', '--subsuite=clipboard'] in /builds/slave/test/build 10:18:02 INFO - Copy/paste: /builds/slave/test/build/venv/bin/python -u /builds/slave/test/build/tests/mochitest/runtests.py --disable-e10s --appname=/builds/slave/test/build/application/firefox/firefox --utility-path=tests/bin --extra-profile-file=tests/bin/plugins --symbols-path=https://queue.taskcluster.net/v1/task/fO5lMFwzS6GfRd-U77rLDg/artifacts/public/build/firefox-49.0a1.en-US.linux-x86_64-asan.crashreporter-symbols.zip --certificate-path=tests/certs --setpref=webgl.force-enabled=true --quiet --log-raw=/builds/slave/test/build/blobber_upload_dir/chrome-clipboard_raw.log --log-errorsummary=/builds/slave/test/build/blobber_upload_dir/chrome-clipboard_errorsummary.log --use-test-media-devices --screenshot-on-fail --chrome --subsuite=clipboard 10:18:02 INFO - Using env: {'DISPLAY': ':0', 10:18:02 INFO - 'HOME': '/home/cltbld', 10:18:02 INFO - 'LANG': 'en_US.UTF-8', 10:18:02 INFO - 'LOGNAME': 'cltbld', 10:18:02 INFO - 'MAIL': '/var/mail/cltbld', 10:18:02 INFO - 'MINIDUMP_SAVE_PATH': '/builds/slave/test/build/blobber_upload_dir', 10:18:02 INFO - 'MINIDUMP_STACKWALK': '/builds/slave/test/build/linux64-minidump_stackwalk', 10:18:02 INFO - 'MOZ_UPLOAD_DIR': '/builds/slave/test/build/blobber_upload_dir', 10:18:03 INFO - 'NODE_PATH': '/usr/lib/nodejs:/usr/lib/node_modules:/usr/share/javascript', 10:18:03 INFO - 'PATH': '/builds/slave/test/build/venv/bin:/usr/local/bin:/usr/local/bin:/usr/bin:/bin:/usr/local/games:/usr/games', 10:18:03 INFO - 'PROPERTIES_FILE': '/builds/slave/test/buildprops.json', 10:18:03 INFO - 'PWD': '/builds/slave/test', 10:18:03 INFO - 'SHELL': '/bin/bash', 10:18:03 INFO - 'SHLVL': '1', 10:18:03 INFO - 'TERM': 'linux', 10:18:03 INFO - 'TMOUT': '86400', 10:18:03 INFO - 'USER': 'cltbld', 10:18:03 INFO - 'XDG_SESSION_COOKIE': '9ca12473fbb1d023794ffd180000023c-1464192605.912671-1195279248', 10:18:03 INFO - '_': '/tools/buildbot/bin/python'} 10:18:03 INFO - Calling ['/builds/slave/test/build/venv/bin/python', '-u', '/builds/slave/test/build/tests/mochitest/runtests.py', '--disable-e10s', '--appname=/builds/slave/test/build/application/firefox/firefox', '--utility-path=tests/bin', '--extra-profile-file=tests/bin/plugins', '--symbols-path=https://queue.taskcluster.net/v1/task/fO5lMFwzS6GfRd-U77rLDg/artifacts/public/build/firefox-49.0a1.en-US.linux-x86_64-asan.crashreporter-symbols.zip', '--certificate-path=tests/certs', '--setpref=webgl.force-enabled=true', '--quiet', '--log-raw=/builds/slave/test/build/blobber_upload_dir/chrome-clipboard_raw.log', '--log-errorsummary=/builds/slave/test/build/blobber_upload_dir/chrome-clipboard_errorsummary.log', '--use-test-media-devices', '--screenshot-on-fail', '--chrome', '--subsuite=clipboard'] with output_timeout 1000 10:18:03 INFO - Checking for orphan ssltunnel processes... 10:18:03 INFO - Checking for orphan xpcshell processes... 10:18:04 INFO - 0 ERROR no tests to run using specified combination of filters: skip_if, run_if, fail_if, remove_imptest_failure_expectations, subsuite(name=clipboard) 10:18:04 INFO - SUITE-START | Running 0 tests 10:18:04 INFO - 1 ERROR no tests to run using specified combination of filters: skip_if, run_if, fail_if, remove_imptest_failure_expectations, subsuite(name=clipboard) 10:18:04 INFO - 0 INFO TEST-START | Shutdown 10:18:04 INFO - 1 INFO Passed: 0 10:18:04 INFO - 2 INFO Failed: 0 10:18:04 INFO - 3 INFO Todo: 0 10:18:04 INFO - 4 INFO Mode: non-e10s 10:18:04 INFO - 5 INFO SimpleTest FINISHED 10:18:04 INFO - SUITE-END | took 0s 10:18:04 ERROR - Return code: 1 10:18:04 ERROR - No tests run or test summary not found 10:18:04 INFO - TinderboxPrint: mochitest-chrome-clipboard
T-FAIL 10:18:04 WARNING - # TBPL FAILURE # 10:18:04 WARNING - setting return code to 2 10:18:04 WARNING - The mochitest suite: chrome-clipboard ran with return status: FAILURE 10:18:04 INFO - ENV: MOZ_UPLOAD_DIR is now /builds/slave/test/build/blobber_upload_dir 10:18:04 INFO - ENV: MINIDUMP_STACKWALK is now /builds/slave/test/build/linux64-minidump_stackwalk 10:18:04 INFO - ENV: MINIDUMP_SAVE_PATH is now /builds/slave/test/build/blobber_upload_dir 10:18:04 INFO - Running command: ['/builds/slave/test/build/venv/bin/python', '-u', '/builds/slave/test/build/tests/mochitest/runtests.py', '--disable-e10s', '--appname=/builds/slave/test/build/application/firefox/firefox', '--utility-path=tests/bin', '--extra-profile-file=tests/bin/plugins', '--symbols-path=https://queue.taskcluster.net/v1/task/fO5lMFwzS6GfRd-U77rLDg/artifacts/public/build/firefox-49.0a1.en-US.linux-x86_64-asan.crashreporter-symbols.zip', '--certificate-path=tests/certs', '--setpref=webgl.force-enabled=true', '--quiet', '--log-raw=/builds/slave/test/build/blobber_upload_dir/browser-chrome-clipboard_raw.log', '--log-errorsummary=/builds/slave/test/build/blobber_upload_dir/browser-chrome-clipboard_errorsummary.log', '--use-test-media-devices', '--screenshot-on-fail', '--browser-chrome', '--subsuite=clipboard'] in /builds/slave/test/build 10:18:04 INFO - Copy/paste: /builds/slave/test/build/venv/bin/python -u /builds/slave/test/build/tests/mochitest/runtests.py --disable-e10s --appname=/builds/slave/test/build/application/firefox/firefox --utility-path=tests/bin --extra-profile-file=tests/bin/plugins --symbols-path=https://queue.taskcluster.net/v1/task/fO5lMFwzS6GfRd-U77rLDg/artifacts/public/build/firefox-49.0a1.en-US.linux-x86_64-asan.crashreporter-symbols.zip --certificate-path=tests/certs --setpref=webgl.force-enabled=true --quiet --log-raw=/builds/slave/test/build/blobber_upload_dir/browser-chrome-clipboard_raw.log --log-errorsummary=/builds/slave/test/build/blobber_upload_dir/browser-chrome-clipboard_errorsummary.log --use-test-media-devices --screenshot-on-fail --browser-chrome --subsuite=clipboard 10:18:04 INFO - Using env: {'DISPLAY': ':0', 10:18:04 INFO - 'HOME': '/home/cltbld', 10:18:04 INFO - 'LANG': 'en_US.UTF-8', 10:18:04 INFO - 'LOGNAME': 'cltbld', 10:18:04 INFO - 'MAIL': '/var/mail/cltbld', 10:18:04 INFO - 'MINIDUMP_SAVE_PATH': '/builds/slave/test/build/blobber_upload_dir', 10:18:04 INFO - 'MINIDUMP_STACKWALK': '/builds/slave/test/build/linux64-minidump_stackwalk', 10:18:04 INFO - 'MOZ_UPLOAD_DIR': '/builds/slave/test/build/blobber_upload_dir', 10:18:04 INFO - 'NODE_PATH': '/usr/lib/nodejs:/usr/lib/node_modules:/usr/share/javascript', 10:18:04 INFO - 'PATH': '/builds/slave/test/build/venv/bin:/usr/local/bin:/usr/local/bin:/usr/bin:/bin:/usr/local/games:/usr/games', 10:18:04 INFO - 'PROPERTIES_FILE': '/builds/slave/test/buildprops.json', 10:18:04 INFO - 'PWD': '/builds/slave/test', 10:18:04 INFO - 'SHELL': '/bin/bash', 10:18:04 INFO - 'SHLVL': '1', 10:18:04 INFO - 'TERM': 'linux', 10:18:04 INFO - 'TMOUT': '86400', 10:18:04 INFO - 'USER': 'cltbld', 10:18:04 INFO - 'XDG_SESSION_COOKIE': '9ca12473fbb1d023794ffd180000023c-1464192605.912671-1195279248', 10:18:04 INFO - '_': '/tools/buildbot/bin/python'} 10:18:04 INFO - Calling ['/builds/slave/test/build/venv/bin/python', '-u', '/builds/slave/test/build/tests/mochitest/runtests.py', '--disable-e10s', '--appname=/builds/slave/test/build/application/firefox/firefox', '--utility-path=tests/bin', '--extra-profile-file=tests/bin/plugins', '--symbols-path=https://queue.taskcluster.net/v1/task/fO5lMFwzS6GfRd-U77rLDg/artifacts/public/build/firefox-49.0a1.en-US.linux-x86_64-asan.crashreporter-symbols.zip', '--certificate-path=tests/certs', '--setpref=webgl.force-enabled=true', '--quiet', '--log-raw=/builds/slave/test/build/blobber_upload_dir/browser-chrome-clipboard_raw.log', '--log-errorsummary=/builds/slave/test/build/blobber_upload_dir/browser-chrome-clipboard_errorsummary.log', '--use-test-media-devices', '--screenshot-on-fail', '--browser-chrome', '--subsuite=clipboard'] with output_timeout 1000 10:18:04 INFO - Checking for orphan ssltunnel processes... 10:18:04 INFO - Checking for orphan xpcshell processes... 10:18:05 INFO - 0 ERROR no tests to run using specified combination of filters: skip_if, run_if, fail_if, remove_imptest_failure_expectations, subsuite(name=clipboard) 10:18:05 INFO - SUITE-START | Running 0 tests 10:18:05 INFO - 1 ERROR no tests to run using specified combination of filters: skip_if, run_if, fail_if, remove_imptest_failure_expectations, subsuite(name=clipboard) 10:18:05 INFO - TEST-INFO | checking window state 10:18:05 INFO - Browser Chrome Test Summary 10:18:05 INFO - Passed: 0 10:18:05 INFO - Failed: 0 10:18:05 INFO - Todo: 0 10:18:05 INFO - Mode: non-e10s 10:18:05 INFO - *** End BrowserChrome Test Results *** 10:18:05 INFO - SUITE-END | took 0s 10:18:05 ERROR - Return code: 1 10:18:05 ERROR - No tests run or test summary not found 10:18:05 INFO - TinderboxPrint: mochitest-browser-chrome-clipboard
T-FAIL 10:18:05 WARNING - # TBPL FAILURE # 10:18:05 WARNING - The mochitest suite: browser-chrome-clipboard ran with return status: FAILURE 10:18:05 INFO - ENV: MOZ_UPLOAD_DIR is now /builds/slave/test/build/blobber_upload_dir 10:18:05 INFO - ENV: MINIDUMP_STACKWALK is now /builds/slave/test/build/linux64-minidump_stackwalk 10:18:05 INFO - ENV: MINIDUMP_SAVE_PATH is now /builds/slave/test/build/blobber_upload_dir 10:18:05 INFO - Running command: ['/builds/slave/test/build/venv/bin/python', '-u', '/builds/slave/test/build/tests/mochitest/runtests.py', '--disable-e10s', '--appname=/builds/slave/test/build/application/firefox/firefox', '--utility-path=tests/bin', '--extra-profile-file=tests/bin/plugins', '--symbols-path=https://queue.taskcluster.net/v1/task/fO5lMFwzS6GfRd-U77rLDg/artifacts/public/build/firefox-49.0a1.en-US.linux-x86_64-asan.crashreporter-symbols.zip', '--certificate-path=tests/certs', '--setpref=webgl.force-enabled=true', '--quiet', '--log-raw=/builds/slave/test/build/blobber_upload_dir/plain-clipboard_raw.log', '--log-errorsummary=/builds/slave/test/build/blobber_upload_dir/plain-clipboard_errorsummary.log', '--use-test-media-devices', '--screenshot-on-fail', '--subsuite=clipboard'] in /builds/slave/test/build 10:18:05 INFO - Copy/paste: /builds/slave/test/build/venv/bin/python -u /builds/slave/test/build/tests/mochitest/runtests.py --disable-e10s --appname=/builds/slave/test/build/application/firefox/firefox --utility-path=tests/bin --extra-profile-file=tests/bin/plugins --symbols-path=https://queue.taskcluster.net/v1/task/fO5lMFwzS6GfRd-U77rLDg/artifacts/public/build/firefox-49.0a1.en-US.linux-x86_64-asan.crashreporter-symbols.zip --certificate-path=tests/certs --setpref=webgl.force-enabled=true --quiet --log-raw=/builds/slave/test/build/blobber_upload_dir/plain-clipboard_raw.log --log-errorsummary=/builds/slave/test/build/blobber_upload_dir/plain-clipboard_errorsummary.log --use-test-media-devices --screenshot-on-fail --subsuite=clipboard 10:18:05 INFO - Using env: {'DISPLAY': ':0', 10:18:05 INFO - 'HOME': '/home/cltbld', 10:18:05 INFO - 'LANG': 'en_US.UTF-8', 10:18:05 INFO - 'LOGNAME': 'cltbld', 10:18:05 INFO - 'MAIL': '/var/mail/cltbld', 10:18:05 INFO - 'MINIDUMP_SAVE_PATH': '/builds/slave/test/build/blobber_upload_dir', 10:18:05 INFO - 'MINIDUMP_STACKWALK': '/builds/slave/test/build/linux64-minidump_stackwalk', 10:18:05 INFO - 'MOZ_UPLOAD_DIR': '/builds/slave/test/build/blobber_upload_dir', 10:18:05 INFO - 'NODE_PATH': '/usr/lib/nodejs:/usr/lib/node_modules:/usr/share/javascript', 10:18:05 INFO - 'PATH': '/builds/slave/test/build/venv/bin:/usr/local/bin:/usr/local/bin:/usr/bin:/bin:/usr/local/games:/usr/games', 10:18:05 INFO - 'PROPERTIES_FILE': '/builds/slave/test/buildprops.json', 10:18:05 INFO - 'PWD': '/builds/slave/test', 10:18:05 INFO - 'SHELL': '/bin/bash', 10:18:05 INFO - 'SHLVL': '1', 10:18:05 INFO - 'TERM': 'linux', 10:18:05 INFO - 'TMOUT': '86400', 10:18:05 INFO - 'USER': 'cltbld', 10:18:05 INFO - 'XDG_SESSION_COOKIE': '9ca12473fbb1d023794ffd180000023c-1464192605.912671-1195279248', 10:18:05 INFO - '_': '/tools/buildbot/bin/python'} 10:18:05 INFO - Calling ['/builds/slave/test/build/venv/bin/python', '-u', '/builds/slave/test/build/tests/mochitest/runtests.py', '--disable-e10s', '--appname=/builds/slave/test/build/application/firefox/firefox', '--utility-path=tests/bin', '--extra-profile-file=tests/bin/plugins', '--symbols-path=https://queue.taskcluster.net/v1/task/fO5lMFwzS6GfRd-U77rLDg/artifacts/public/build/firefox-49.0a1.en-US.linux-x86_64-asan.crashreporter-symbols.zip', '--certificate-path=tests/certs', '--setpref=webgl.force-enabled=true', '--quiet', '--log-raw=/builds/slave/test/build/blobber_upload_dir/plain-clipboard_raw.log', '--log-errorsummary=/builds/slave/test/build/blobber_upload_dir/plain-clipboard_errorsummary.log', '--use-test-media-devices', '--screenshot-on-fail', '--subsuite=clipboard'] with output_timeout 1000 10:18:05 INFO - Checking for orphan ssltunnel processes... 10:18:05 INFO - Checking for orphan xpcshell processes... 10:18:06 INFO - 0 ERROR no tests to run using specified combination of filters: skip_if, run_if, fail_if, remove_imptest_failure_expectations, subsuite(name=clipboard) 10:18:06 INFO - SUITE-START | Running 0 tests 10:18:07 INFO - 1 ERROR no tests to run using specified combination of filters: skip_if, run_if, fail_if, remove_imptest_failure_expectations, subsuite(name=clipboard) 10:18:07 INFO - 0 INFO TEST-START | Shutdown 10:18:07 INFO - 1 INFO Passed: 0 10:18:07 INFO - 2 INFO Failed: 0 10:18:07 INFO - 3 INFO Todo: 0 10:18:07 INFO - 4 INFO Mode: non-e10s 10:18:07 INFO - 5 INFO SimpleTest FINISHED 10:18:07 INFO - SUITE-END | took 0s 10:18:07 ERROR - Return code: 1 10:18:07 ERROR - No tests run or test summary not found 10:18:07 INFO - TinderboxPrint: mochitest-plain-clipboard
T-FAIL 10:18:07 WARNING - # TBPL FAILURE # 10:18:07 WARNING - The mochitest suite: plain-clipboard ran with return status: FAILURE 10:18:07 INFO - ENV: MOZ_UPLOAD_DIR is now /builds/slave/test/build/blobber_upload_dir 10:18:07 INFO - ENV: MINIDUMP_STACKWALK is now /builds/slave/test/build/linux64-minidump_stackwalk 10:18:07 INFO - ENV: MINIDUMP_SAVE_PATH is now /builds/slave/test/build/blobber_upload_dir 10:18:07 INFO - Running command: ['/builds/slave/test/build/venv/bin/python', '-u', '/builds/slave/test/build/tests/mochitest/runtests.py', '--disable-e10s', '--appname=/builds/slave/test/build/application/firefox/firefox', '--utility-path=tests/bin', '--extra-profile-file=tests/bin/plugins', '--symbols-path=https://queue.taskcluster.net/v1/task/fO5lMFwzS6GfRd-U77rLDg/artifacts/public/build/firefox-49.0a1.en-US.linux-x86_64-asan.crashreporter-symbols.zip', '--certificate-path=tests/certs', '--setpref=webgl.force-enabled=true', '--quiet', '--log-raw=/builds/slave/test/build/blobber_upload_dir/jetpack-package-clipboard_raw.log', '--log-errorsummary=/builds/slave/test/build/blobber_upload_dir/jetpack-package-clipboard_errorsummary.log', '--use-test-media-devices', '--screenshot-on-fail', '--jetpack-package', '--subsuite=clipboard'] in /builds/slave/test/build 10:18:07 INFO - Copy/paste: /builds/slave/test/build/venv/bin/python -u /builds/slave/test/build/tests/mochitest/runtests.py --disable-e10s --appname=/builds/slave/test/build/application/firefox/firefox --utility-path=tests/bin --extra-profile-file=tests/bin/plugins --symbols-path=https://queue.taskcluster.net/v1/task/fO5lMFwzS6GfRd-U77rLDg/artifacts/public/build/firefox-49.0a1.en-US.linux-x86_64-asan.crashreporter-symbols.zip --certificate-path=tests/certs --setpref=webgl.force-enabled=true --quiet --log-raw=/builds/slave/test/build/blobber_upload_dir/jetpack-package-clipboard_raw.log --log-errorsummary=/builds/slave/test/build/blobber_upload_dir/jetpack-package-clipboard_errorsummary.log --use-test-media-devices --screenshot-on-fail --jetpack-package --subsuite=clipboard 10:18:07 INFO - Using env: {'DISPLAY': ':0', 10:18:07 INFO - 'HOME': '/home/cltbld', 10:18:07 INFO - 'LANG': 'en_US.UTF-8', 10:18:07 INFO - 'LOGNAME': 'cltbld', 10:18:07 INFO - 'MAIL': '/var/mail/cltbld', 10:18:07 INFO - 'MINIDUMP_SAVE_PATH': '/builds/slave/test/build/blobber_upload_dir', 10:18:07 INFO - 'MINIDUMP_STACKWALK': '/builds/slave/test/build/linux64-minidump_stackwalk', 10:18:07 INFO - 'MOZ_UPLOAD_DIR': '/builds/slave/test/build/blobber_upload_dir', 10:18:07 INFO - 'NODE_PATH': '/usr/lib/nodejs:/usr/lib/node_modules:/usr/share/javascript', 10:18:07 INFO - 'PATH': '/builds/slave/test/build/venv/bin:/usr/local/bin:/usr/local/bin:/usr/bin:/bin:/usr/local/games:/usr/games', 10:18:07 INFO - 'PROPERTIES_FILE': '/builds/slave/test/buildprops.json', 10:18:07 INFO - 'PWD': '/builds/slave/test', 10:18:07 INFO - 'SHELL': '/bin/bash', 10:18:07 INFO - 'SHLVL': '1', 10:18:07 INFO - 'TERM': 'linux', 10:18:07 INFO - 'TMOUT': '86400', 10:18:07 INFO - 'USER': 'cltbld', 10:18:07 INFO - 'XDG_SESSION_COOKIE': '9ca12473fbb1d023794ffd180000023c-1464192605.912671-1195279248', 10:18:07 INFO - '_': '/tools/buildbot/bin/python'} 10:18:07 INFO - Calling ['/builds/slave/test/build/venv/bin/python', '-u', '/builds/slave/test/build/tests/mochitest/runtests.py', '--disable-e10s', '--appname=/builds/slave/test/build/application/firefox/firefox', '--utility-path=tests/bin', '--extra-profile-file=tests/bin/plugins', '--symbols-path=https://queue.taskcluster.net/v1/task/fO5lMFwzS6GfRd-U77rLDg/artifacts/public/build/firefox-49.0a1.en-US.linux-x86_64-asan.crashreporter-symbols.zip', '--certificate-path=tests/certs', '--setpref=webgl.force-enabled=true', '--quiet', '--log-raw=/builds/slave/test/build/blobber_upload_dir/jetpack-package-clipboard_raw.log', '--log-errorsummary=/builds/slave/test/build/blobber_upload_dir/jetpack-package-clipboard_errorsummary.log', '--use-test-media-devices', '--screenshot-on-fail', '--jetpack-package', '--subsuite=clipboard'] with output_timeout 1000 10:18:07 INFO - Checking for orphan ssltunnel processes... 10:18:07 INFO - Checking for orphan xpcshell processes... 10:18:07 INFO - 0 ERROR no tests to run using specified combination of filters: skip_if, run_if, fail_if, remove_imptest_failure_expectations, subsuite(name=clipboard) 10:18:07 INFO - SUITE-START | Running 0 tests 10:18:07 INFO - Setting pipeline to PAUSED ... 10:18:07 INFO - libv4l2: error getting pixformat: Invalid argument 10:18:07 INFO - Pipeline is PREROLLING ... 10:18:08 INFO - Pipeline is PREROLLED ... 10:18:08 INFO - Setting pipeline to PLAYING ... 10:18:08 INFO - New clock: GstSystemClock 10:18:08 INFO - Got EOS from element "pipeline0". 10:18:08 INFO - Execution ended after 32399446 ns. 10:18:08 INFO - Setting pipeline to PAUSED ... 10:18:08 INFO - Setting pipeline to READY ... 10:18:08 INFO - Setting pipeline to NULL ... 10:18:08 INFO - Freeing pipeline ... 10:18:08 INFO - 23 10:18:08 INFO - mozprofile.addons WARNING | Could not install /builds/slave/test/build/tests/mochitest/extensions/mozscreenshots: [Errno 2] No such file or directory: '/builds/slave/test/build/tests/mochitest/extensions/mozscreenshots/install.rdf' 10:18:08 INFO - INFO | runtests.py | ASan using symbolizer at /builds/slave/test/build/application/firefox/llvm-symbolizer 10:18:08 INFO - INFO | runtests.py | ASan running in low-memory configuration 10:18:09 INFO - pk12util: PKCS12 IMPORT SUCCESSFUL 10:18:09 INFO - INFO | runtests.py | ASan using symbolizer at /builds/slave/test/build/application/firefox/llvm-symbolizer 10:18:09 INFO - LSan enabled. 10:18:09 INFO - LSan using suppression file /builds/slave/test/build/tests/mochitest/lsan_suppressions.txt 10:18:09 INFO - INFO | runtests.py | ASan running in low-memory configuration 10:18:09 INFO - INFO | runtests.py | ASan using symbolizer at /builds/slave/test/build/application/firefox/llvm-symbolizer 10:18:09 INFO - INFO | runtests.py | ASan running in low-memory configuration 10:18:09 INFO - MochitestServer : launching [u'/builds/slave/test/build/tests/bin/xpcshell', '-g', '/builds/slave/test/build/application/firefox', '-v', '170', '-f', '/builds/slave/test/build/tests/bin/components/httpd.js', '-e', "const _PROFILE_PATH = '/tmp/tmpYVViM9.mozrunner'; const _SERVER_PORT = '8888'; const _SERVER_ADDR = '127.0.0.1'; const _TEST_PREFIX = undefined; const _DISPLAY_RESULTS = false;", '-f', '/builds/slave/test/build/tests/mochitest/server.js'] 10:18:09 INFO - runtests.py | Server pid: 2062 10:18:09 INFO - runtests.py | Websocket server pid: 2065 10:18:09 INFO - INFO | runtests.py | ASan using symbolizer at /builds/slave/test/build/application/firefox/llvm-symbolizer 10:18:09 INFO - INFO | runtests.py | ASan running in low-memory configuration 10:18:09 INFO - runtests.py | SSL tunnel pid: 2070 10:18:10 INFO - 1 ERROR no tests to run using specified combination of filters: skip_if, run_if, fail_if, remove_imptest_failure_expectations, subsuite(name=clipboard) 10:18:10 INFO - Stopping web server 10:18:10 INFO - Stopping web socket server 10:18:10 INFO - Stopping ssltunnel 10:18:10 INFO - SUITE-END | took 2s 10:18:10 ERROR - Return code: 1 10:18:10 ERROR - No tests run or test summary not found 10:18:10 INFO - TinderboxPrint: mochitest-jetpack-package-clipboard
T-FAIL 10:18:10 WARNING - # TBPL FAILURE # 10:18:10 WARNING - The mochitest suite: jetpack-package-clipboard ran with return status: FAILURE 10:18:10 INFO - Running post-action listener: _package_coverage_data 10:18:10 INFO - Running post-action listener: _resource_record_post_action 10:18:10 INFO - ##### 10:18:10 INFO - ##### Finished run-tests step (success) 10:18:10 INFO - ##### 10:18:10 INFO - Running post-run listener: _resource_record_post_run 10:18:10 INFO - Total resource usage - Wall time: 100s; CPU: 100.0%; Read bytes: 4407296; Write bytes: 775364608; Read time: 992; Write time: 851180 10:18:10 INFO - TinderboxPrint: CPU usage
99.7% 10:18:10 INFO - TinderboxPrint: I/O read bytes / time
4,407,296 / 992 10:18:10 INFO - TinderboxPrint: I/O write bytes / time
775,364,608 / 851,180 10:18:10 INFO - TinderboxPrint: CPU system
6.0 (6.0%) 10:18:10 INFO - TinderboxPrint: CPU user
93.3 (93.3%) 10:18:10 INFO - TinderboxPrint: Swap in / out
0 / 0 10:18:10 INFO - install - Wall time: 92s; CPU: 100.0%; Read bytes: 0; Write bytes: 613568512; Read time: 0; Write time: 672428 10:18:10 INFO - run-tests - Wall time: 8s; CPU: 96.0%; Read bytes: 4333568; Write bytes: 69496832; Read time: 936; Write time: 87700 10:18:10 INFO - Running post-run listener: _upload_blobber_files 10:18:10 INFO - Blob upload gear active. 10:18:10 INFO - Preparing to upload files from /builds/slave/test/build/blobber_upload_dir. 10:18:10 INFO - Files from /builds/slave/test/build/blobber_upload_dir are to be uploaded with branch at the following location(s): https://blobupload.elasticbeanstalk.com 10:18:10 INFO - Running command: ['/builds/slave/test/build/venv/bin/python', '/builds/slave/test/build/venv/bin/blobberc.py', '-u', 'https://blobupload.elasticbeanstalk.com', '-a', '/builds/slave/test/oauth.txt', '-b', 'fx-team', '-d', '/builds/slave/test/build/blobber_upload_dir', '--output-manifest', '/builds/slave/test/build/uploaded_files.json'] 10:18:10 INFO - Copy/paste: /builds/slave/test/build/venv/bin/python /builds/slave/test/build/venv/bin/blobberc.py -u https://blobupload.elasticbeanstalk.com -a /builds/slave/test/oauth.txt -b fx-team -d /builds/slave/test/build/blobber_upload_dir --output-manifest /builds/slave/test/build/uploaded_files.json 10:18:11 INFO - (blobuploader) - INFO - Open directory for files ... 10:18:11 INFO - (blobuploader) - INFO - Uploading /builds/slave/test/build/blobber_upload_dir/browser-chrome-clipboard_errorsummary.log ... 10:18:11 INFO - (blobuploader) - INFO - Using https://blobupload.elasticbeanstalk.com 10:18:11 INFO - (blobuploader) - INFO - Uploading, attempt #1. 10:18:13 INFO - (blobuploader) - INFO - TinderboxPrint: browser-chrome-clipboard_errorsummary.log: uploaded 10:18:13 INFO - (blobuploader) - INFO - Blobserver returned 202. File uploaded! 10:18:13 INFO - (blobuploader) - INFO - Done attempting. 10:18:13 INFO - (blobuploader) - INFO - Uploading /builds/slave/test/build/blobber_upload_dir/plain-clipboard_errorsummary.log ... 10:18:13 INFO - (blobuploader) - INFO - Using https://blobupload.elasticbeanstalk.com 10:18:13 INFO - (blobuploader) - INFO - Uploading, attempt #1. 10:18:14 INFO - (blobuploader) - INFO - TinderboxPrint: plain-clipboard_errorsummary.log: uploaded 10:18:14 INFO - (blobuploader) - INFO - Blobserver returned 202. File uploaded! 10:18:14 INFO - (blobuploader) - INFO - Done attempting. 10:18:14 INFO - (blobuploader) - INFO - Uploading /builds/slave/test/build/blobber_upload_dir/chrome-clipboard_raw.log ... 10:18:14 INFO - (blobuploader) - INFO - Using https://blobupload.elasticbeanstalk.com 10:18:14 INFO - (blobuploader) - INFO - Uploading, attempt #1. 10:18:14 INFO - (blobuploader) - INFO - TinderboxPrint: chrome-clipboard_raw.log: uploaded 10:18:14 INFO - (blobuploader) - INFO - Blobserver returned 202. File uploaded! 10:18:14 INFO - (blobuploader) - INFO - Done attempting. 10:18:14 INFO - (blobuploader) - INFO - Uploading /builds/slave/test/build/blobber_upload_dir/jetpack-package-clipboard_raw.log ... 10:18:14 INFO - (blobuploader) - INFO - Using https://blobupload.elasticbeanstalk.com 10:18:14 INFO - (blobuploader) - INFO - Uploading, attempt #1. 10:18:15 INFO - (blobuploader) - INFO - TinderboxPrint: jetpack-package-clipboard_raw.log: uploaded 10:18:15 INFO - (blobuploader) - INFO - Blobserver returned 202. File uploaded! 10:18:15 INFO - (blobuploader) - INFO - Done attempting. 10:18:15 INFO - (blobuploader) - INFO - Uploading /builds/slave/test/build/blobber_upload_dir/resource-usage.json ... 10:18:15 INFO - (blobuploader) - INFO - Using https://blobupload.elasticbeanstalk.com 10:18:15 INFO - (blobuploader) - INFO - Uploading, attempt #1. 10:18:16 INFO - (blobuploader) - INFO - TinderboxPrint: resource-usage.json: uploaded 10:18:16 INFO - (blobuploader) - INFO - Blobserver returned 202. File uploaded! 10:18:16 INFO - (blobuploader) - INFO - Done attempting. 10:18:16 INFO - (blobuploader) - INFO - Uploading /builds/slave/test/build/blobber_upload_dir/browser-chrome-clipboard_raw.log ... 10:18:16 INFO - (blobuploader) - INFO - Using https://blobupload.elasticbeanstalk.com 10:18:16 INFO - (blobuploader) - INFO - Uploading, attempt #1. 10:18:17 INFO - (blobuploader) - INFO - TinderboxPrint: browser-chrome-clipboard_raw.log: uploaded 10:18:17 INFO - (blobuploader) - INFO - Blobserver returned 202. File uploaded! 10:18:17 INFO - (blobuploader) - INFO - Done attempting. 10:18:17 INFO - (blobuploader) - INFO - Uploading /builds/slave/test/build/blobber_upload_dir/plain-clipboard_raw.log ... 10:18:17 INFO - (blobuploader) - INFO - Using https://blobupload.elasticbeanstalk.com 10:18:17 INFO - (blobuploader) - INFO - Uploading, attempt #1. 10:18:18 INFO - (blobuploader) - INFO - TinderboxPrint: plain-clipboard_raw.log: uploaded 10:18:18 INFO - (blobuploader) - INFO - Blobserver returned 202. File uploaded! 10:18:18 INFO - (blobuploader) - INFO - Done attempting. 10:18:18 INFO - (blobuploader) - INFO - Uploading /builds/slave/test/build/blobber_upload_dir/chrome-clipboard_errorsummary.log ... 10:18:18 INFO - (blobuploader) - INFO - Using https://blobupload.elasticbeanstalk.com 10:18:18 INFO - (blobuploader) - INFO - Uploading, attempt #1. 10:18:19 INFO - (blobuploader) - INFO - TinderboxPrint: chrome-clipboard_errorsummary.log: uploaded 10:18:19 INFO - (blobuploader) - INFO - Blobserver returned 202. File uploaded! 10:18:19 INFO - (blobuploader) - INFO - Done attempting. 10:18:19 INFO - (blobuploader) - INFO - Uploading /builds/slave/test/build/blobber_upload_dir/jetpack-package-clipboard_errorsummary.log ... 10:18:19 INFO - (blobuploader) - INFO - Using https://blobupload.elasticbeanstalk.com 10:18:19 INFO - (blobuploader) - INFO - Uploading, attempt #1. 10:18:20 INFO - (blobuploader) - INFO - TinderboxPrint: jetpack-package-clipboard_errorsummary.log: uploaded 10:18:20 INFO - (blobuploader) - INFO - Blobserver returned 202. File uploaded! 10:18:20 INFO - (blobuploader) - INFO - Done attempting. 10:18:20 INFO - (blobuploader) - INFO - Iteration through files over. 10:18:20 INFO - Return code: 0 10:18:20 INFO - rmtree: /builds/slave/test/build/uploaded_files.json 10:18:20 INFO - retry: Calling remove with args: ('/builds/slave/test/build/uploaded_files.json',), kwargs: {}, attempt #1 10:18:20 INFO - Setting buildbot property blobber_files to {"chrome-clipboard_raw.log": "http://mozilla-releng-blobs.s3.amazonaws.com/blobs/fx-team/sha512/983af4bb1e2a96eeabee618c196259edcf50c288bd50dce4a44e90c55f062b3802c3d8cbe0e292f71f1e3c01f8d3076ed02076ee140ca20bf3394872e48dc0b9", "browser-chrome-clipboard_raw.log": "http://mozilla-releng-blobs.s3.amazonaws.com/blobs/fx-team/sha512/cef00aa60025389036f4d3db787aa6ea29b0ad108d92cd46eb8b894341a2d828f2ffd39e8667f98ea0f52ccd29a7e6e3f6114b9db438582bcb6adac96c5e4bd1", "jetpack-package-clipboard_raw.log": "http://mozilla-releng-blobs.s3.amazonaws.com/blobs/fx-team/sha512/1125d68f535705ed6abb56722d153ed9551b8dbf305b6517c2f5c8db6e8f64e28dda58a55dcb5c13883ca5b9decd0cfb59ae5e8d2eca07bfdac3127c48265b1d", "chrome-clipboard_errorsummary.log": "http://mozilla-releng-blobs.s3.amazonaws.com/blobs/fx-team/sha512/c41b2864c6cdccc05ab181d1caf5b69e09f1b1ba1eb29291ebefdac3f680494dcc23572fa79766a9d8f10455d5c893d45766478c8e7a872c681172595a604317", "plain-clipboard_errorsummary.log": "http://mozilla-releng-blobs.s3.amazonaws.com/blobs/fx-team/sha512/76fe7d1a04b0536af3c8ee98c74881755e637486600ee9b141c80ab86d7061b348e44ce035d145f668cd0b337c11dc0ab2f8a2d0fd54cae83e0ac3808349e3d7", "resource-usage.json": "http://mozilla-releng-blobs.s3.amazonaws.com/blobs/fx-team/sha512/a0646919f731c355be4d1d8c8b323d09e0d3995ba94cd7d7bbd50ad9d1108eb071cf04320f86da2635fd3c3611c2222bd560d9f29741cf1ef03c280d29f8589c", "browser-chrome-clipboard_errorsummary.log": "http://mozilla-releng-blobs.s3.amazonaws.com/blobs/fx-team/sha512/98554acd816927c89596932e0a5b0216748eb50113dabd2fc2d06257de5e80570a2547952e91b3feff07ca136e357de28253e400656163caeea46033b1dd98b5", "plain-clipboard_raw.log": "http://mozilla-releng-blobs.s3.amazonaws.com/blobs/fx-team/sha512/ca687710093da51cf15fa492ab1e7a786a88807a7b4a97bcdb372a6670404391869b06f1502196c30cf77fa49bf5ecee2c0eaa988b9217040459cabbab91df67", "jetpack-package-clipboard_errorsummary.log": "http://mozilla-releng-blobs.s3.amazonaws.com/blobs/fx-team/sha512/5b7063cca6757dbbe62b317554af9c1f239db6ee4b5a3634a41c5dcd1a93677c6fc4784008e4ce192d895baa33ec5346c408e80fc9a8bcfc629cf296763f04a5"} 10:18:20 INFO - Writing buildbot properties ['blobber_files'] to /builds/slave/test/properties/blobber_files 10:18:20 INFO - Writing to file /builds/slave/test/properties/blobber_files 10:18:20 INFO - Contents: 10:18:20 INFO - blobber_files:{"chrome-clipboard_raw.log": "http://mozilla-releng-blobs.s3.amazonaws.com/blobs/fx-team/sha512/983af4bb1e2a96eeabee618c196259edcf50c288bd50dce4a44e90c55f062b3802c3d8cbe0e292f71f1e3c01f8d3076ed02076ee140ca20bf3394872e48dc0b9", "browser-chrome-clipboard_raw.log": "http://mozilla-releng-blobs.s3.amazonaws.com/blobs/fx-team/sha512/cef00aa60025389036f4d3db787aa6ea29b0ad108d92cd46eb8b894341a2d828f2ffd39e8667f98ea0f52ccd29a7e6e3f6114b9db438582bcb6adac96c5e4bd1", "jetpack-package-clipboard_raw.log": "http://mozilla-releng-blobs.s3.amazonaws.com/blobs/fx-team/sha512/1125d68f535705ed6abb56722d153ed9551b8dbf305b6517c2f5c8db6e8f64e28dda58a55dcb5c13883ca5b9decd0cfb59ae5e8d2eca07bfdac3127c48265b1d", "chrome-clipboard_errorsummary.log": "http://mozilla-releng-blobs.s3.amazonaws.com/blobs/fx-team/sha512/c41b2864c6cdccc05ab181d1caf5b69e09f1b1ba1eb29291ebefdac3f680494dcc23572fa79766a9d8f10455d5c893d45766478c8e7a872c681172595a604317", "plain-clipboard_errorsummary.log": "http://mozilla-releng-blobs.s3.amazonaws.com/blobs/fx-team/sha512/76fe7d1a04b0536af3c8ee98c74881755e637486600ee9b141c80ab86d7061b348e44ce035d145f668cd0b337c11dc0ab2f8a2d0fd54cae83e0ac3808349e3d7", "resource-usage.json": "http://mozilla-releng-blobs.s3.amazonaws.com/blobs/fx-team/sha512/a0646919f731c355be4d1d8c8b323d09e0d3995ba94cd7d7bbd50ad9d1108eb071cf04320f86da2635fd3c3611c2222bd560d9f29741cf1ef03c280d29f8589c", "browser-chrome-clipboard_errorsummary.log": "http://mozilla-releng-blobs.s3.amazonaws.com/blobs/fx-team/sha512/98554acd816927c89596932e0a5b0216748eb50113dabd2fc2d06257de5e80570a2547952e91b3feff07ca136e357de28253e400656163caeea46033b1dd98b5", "plain-clipboard_raw.log": "http://mozilla-releng-blobs.s3.amazonaws.com/blobs/fx-team/sha512/ca687710093da51cf15fa492ab1e7a786a88807a7b4a97bcdb372a6670404391869b06f1502196c30cf77fa49bf5ecee2c0eaa988b9217040459cabbab91df67", "jetpack-package-clipboard_errorsummary.log": "http://mozilla-releng-blobs.s3.amazonaws.com/blobs/fx-team/sha512/5b7063cca6757dbbe62b317554af9c1f239db6ee4b5a3634a41c5dcd1a93677c6fc4784008e4ce192d895baa33ec5346c408e80fc9a8bcfc629cf296763f04a5"} 10:18:20 INFO - Running post-run listener: copy_logs_to_upload_dir 10:18:20 INFO - Copying logs to upload dir... 10:18:20 INFO - mkdir: /builds/slave/test/build/upload/logs 10:18:20 INFO - Copying logs to upload dir... 10:18:20 WARNING - returning nonzero exit status 2 program finished with exit code 2 elapsedTime=238.390066 ========= master_lag: 0.04 ========= ========= Finished '/tools/buildbot/bin/python scripts/scripts/desktop_unittest.py ...' failed (results: 2, elapsed: 3 mins, 58 secs) (at 2016-05-25 10:18:20.551982) ========= ========= Started set props: build_url blobber_files (results: 0, elapsed: 0 secs) (at 2016-05-25 10:18:20.552855) ========= bash -c 'for file in `ls -1`; do cat $file; done' in dir /builds/slave/test/properties (timeout 1200 secs) watching logfiles {} argv: ['bash', '-c', 'for file in `ls -1`; do cat $file; done'] environment: HOME=/home/cltbld LANG=en_US.UTF-8 LOGNAME=cltbld MAIL=/var/mail/cltbld NODE_PATH=/usr/lib/nodejs:/usr/lib/node_modules:/usr/share/javascript PATH=/usr/local/bin:/usr/local/bin:/usr/bin:/bin:/usr/local/games:/usr/games PWD=/builds/slave/test/properties SHELL=/bin/bash SHLVL=1 TERM=linux TMOUT=86400 USER=cltbld XDG_SESSION_COOKIE=9ca12473fbb1d023794ffd180000023c-1464192605.912671-1195279248 _=/tools/buildbot/bin/python using PTY: False blobber_files:{"chrome-clipboard_raw.log": "http://mozilla-releng-blobs.s3.amazonaws.com/blobs/fx-team/sha512/983af4bb1e2a96eeabee618c196259edcf50c288bd50dce4a44e90c55f062b3802c3d8cbe0e292f71f1e3c01f8d3076ed02076ee140ca20bf3394872e48dc0b9", "browser-chrome-clipboard_raw.log": "http://mozilla-releng-blobs.s3.amazonaws.com/blobs/fx-team/sha512/cef00aa60025389036f4d3db787aa6ea29b0ad108d92cd46eb8b894341a2d828f2ffd39e8667f98ea0f52ccd29a7e6e3f6114b9db438582bcb6adac96c5e4bd1", "jetpack-package-clipboard_raw.log": "http://mozilla-releng-blobs.s3.amazonaws.com/blobs/fx-team/sha512/1125d68f535705ed6abb56722d153ed9551b8dbf305b6517c2f5c8db6e8f64e28dda58a55dcb5c13883ca5b9decd0cfb59ae5e8d2eca07bfdac3127c48265b1d", "chrome-clipboard_errorsummary.log": "http://mozilla-releng-blobs.s3.amazonaws.com/blobs/fx-team/sha512/c41b2864c6cdccc05ab181d1caf5b69e09f1b1ba1eb29291ebefdac3f680494dcc23572fa79766a9d8f10455d5c893d45766478c8e7a872c681172595a604317", "plain-clipboard_errorsummary.log": "http://mozilla-releng-blobs.s3.amazonaws.com/blobs/fx-team/sha512/76fe7d1a04b0536af3c8ee98c74881755e637486600ee9b141c80ab86d7061b348e44ce035d145f668cd0b337c11dc0ab2f8a2d0fd54cae83e0ac3808349e3d7", "resource-usage.json": "http://mozilla-releng-blobs.s3.amazonaws.com/blobs/fx-team/sha512/a0646919f731c355be4d1d8c8b323d09e0d3995ba94cd7d7bbd50ad9d1108eb071cf04320f86da2635fd3c3611c2222bd560d9f29741cf1ef03c280d29f8589c", "browser-chrome-clipboard_errorsummary.log": "http://mozilla-releng-blobs.s3.amazonaws.com/blobs/fx-team/sha512/98554acd816927c89596932e0a5b0216748eb50113dabd2fc2d06257de5e80570a2547952e91b3feff07ca136e357de28253e400656163caeea46033b1dd98b5", "plain-clipboard_raw.log": "http://mozilla-releng-blobs.s3.amazonaws.com/blobs/fx-team/sha512/ca687710093da51cf15fa492ab1e7a786a88807a7b4a97bcdb372a6670404391869b06f1502196c30cf77fa49bf5ecee2c0eaa988b9217040459cabbab91df67", "jetpack-package-clipboard_errorsummary.log": "http://mozilla-releng-blobs.s3.amazonaws.com/blobs/fx-team/sha512/5b7063cca6757dbbe62b317554af9c1f239db6ee4b5a3634a41c5dcd1a93677c6fc4784008e4ce192d895baa33ec5346c408e80fc9a8bcfc629cf296763f04a5"} build_url:https://queue.taskcluster.net/v1/task/fO5lMFwzS6GfRd-U77rLDg/artifacts/public/build/firefox-49.0a1.en-US.linux-x86_64-asan.tar.bz2 program finished with exit code 0 elapsedTime=0.034151 build_url: 'https://queue.taskcluster.net/v1/task/fO5lMFwzS6GfRd-U77rLDg/artifacts/public/build/firefox-49.0a1.en-US.linux-x86_64-asan.tar.bz2' blobber_files: '{"chrome-clipboard_raw.log": "http://mozilla-releng-blobs.s3.amazonaws.com/blobs/fx-team/sha512/983af4bb1e2a96eeabee618c196259edcf50c288bd50dce4a44e90c55f062b3802c3d8cbe0e292f71f1e3c01f8d3076ed02076ee140ca20bf3394872e48dc0b9", "browser-chrome-clipboard_raw.log": "http://mozilla-releng-blobs.s3.amazonaws.com/blobs/fx-team/sha512/cef00aa60025389036f4d3db787aa6ea29b0ad108d92cd46eb8b894341a2d828f2ffd39e8667f98ea0f52ccd29a7e6e3f6114b9db438582bcb6adac96c5e4bd1", "jetpack-package-clipboard_raw.log": "http://mozilla-releng-blobs.s3.amazonaws.com/blobs/fx-team/sha512/1125d68f535705ed6abb56722d153ed9551b8dbf305b6517c2f5c8db6e8f64e28dda58a55dcb5c13883ca5b9decd0cfb59ae5e8d2eca07bfdac3127c48265b1d", "chrome-clipboard_errorsummary.log": "http://mozilla-releng-blobs.s3.amazonaws.com/blobs/fx-team/sha512/c41b2864c6cdccc05ab181d1caf5b69e09f1b1ba1eb29291ebefdac3f680494dcc23572fa79766a9d8f10455d5c893d45766478c8e7a872c681172595a604317", "plain-clipboard_errorsummary.log": "http://mozilla-releng-blobs.s3.amazonaws.com/blobs/fx-team/sha512/76fe7d1a04b0536af3c8ee98c74881755e637486600ee9b141c80ab86d7061b348e44ce035d145f668cd0b337c11dc0ab2f8a2d0fd54cae83e0ac3808349e3d7", "resource-usage.json": "http://mozilla-releng-blobs.s3.amazonaws.com/blobs/fx-team/sha512/a0646919f731c355be4d1d8c8b323d09e0d3995ba94cd7d7bbd50ad9d1108eb071cf04320f86da2635fd3c3611c2222bd560d9f29741cf1ef03c280d29f8589c", "browser-chrome-clipboard_errorsummary.log": "http://mozilla-releng-blobs.s3.amazonaws.com/blobs/fx-team/sha512/98554acd816927c89596932e0a5b0216748eb50113dabd2fc2d06257de5e80570a2547952e91b3feff07ca136e357de28253e400656163caeea46033b1dd98b5", "plain-clipboard_raw.log": "http://mozilla-releng-blobs.s3.amazonaws.com/blobs/fx-team/sha512/ca687710093da51cf15fa492ab1e7a786a88807a7b4a97bcdb372a6670404391869b06f1502196c30cf77fa49bf5ecee2c0eaa988b9217040459cabbab91df67", "jetpack-package-clipboard_errorsummary.log": "http://mozilla-releng-blobs.s3.amazonaws.com/blobs/fx-team/sha512/5b7063cca6757dbbe62b317554af9c1f239db6ee4b5a3634a41c5dcd1a93677c6fc4784008e4ce192d895baa33ec5346c408e80fc9a8bcfc629cf296763f04a5"}' ========= master_lag: 0.03 ========= ========= Finished set props: build_url blobber_files (results: 0, elapsed: 0 secs) (at 2016-05-25 10:18:20.620086) ========= ========= Started 'rm -f ...' (results: 0, elapsed: 0 secs) (at 2016-05-25 10:18:20.620433) ========= rm -f oauth.txt in dir /builds/slave/test/. (timeout 1200 secs) watching logfiles {} argv: ['rm', '-f', 'oauth.txt'] environment: HOME=/home/cltbld LANG=en_US.UTF-8 LOGNAME=cltbld MAIL=/var/mail/cltbld NODE_PATH=/usr/lib/nodejs:/usr/lib/node_modules:/usr/share/javascript PATH=/usr/local/bin:/usr/local/bin:/usr/bin:/bin:/usr/local/games:/usr/games PWD=/builds/slave/test SHELL=/bin/bash SHLVL=1 TERM=linux TMOUT=86400 USER=cltbld XDG_SESSION_COOKIE=9ca12473fbb1d023794ffd180000023c-1464192605.912671-1195279248 _=/tools/buildbot/bin/python using PTY: False program finished with exit code 0 elapsedTime=0.021769 ========= master_lag: 0.07 ========= ========= Finished 'rm -f ...' (results: 0, elapsed: 0 secs) (at 2016-05-25 10:18:20.707626) ========= ========= Started reboot skipped (results: 3, elapsed: 0 secs) (at 2016-05-25 10:18:20.707966) ========= ========= Finished reboot skipped (results: 3, elapsed: 0 secs) (at 2016-05-25 10:18:20.708389) ========= ========= Total master_lag: 0.27 =========